BDBM54226 (3-amino-7-methoxy-1-pyrazolo[3,4-b]quinolinyl)-(4-chloro-3-nitrophenyl)methanone::(3-amino-7-methoxy-pyrazolo[3,4-b]quinolin-1-yl)-(4-chloro-3-nitro-phenyl)methanone::(3-amino-7-methoxypyrazolo[3,4-b]quinolin-1-yl)-(4-chloro-3-nitrophenyl)methanone::(3-azanyl-7-methoxy-pyrazolo[3,4-b]quinolin-1-yl)-(4-chloranyl-3-nitro-phenyl)methanone::1-(4-chloro-3-nitrobenzoyl)-7-methoxy-1H-pyrazolo[3,4-b]quinolin-3-amine::MLS000582480::SMR000206466::cid_12004545
SMILES: COc1ccc2cc3c(N)nn(C(=O)c4ccc(Cl)c(c4)[N+]([O-])=O)c3nc2c1
InChI Key: InChIKey=HMVMIYZPGBNYIM-UHFFFAOYSA-N
Data: 5 IC50  1 EC50
Activity Spreadsheet -- Enzyme Inhibition Constant Data from BindingDB
Found 6 hits for monomerid = 54226
Trg + Lig
Ki
nM
ΔG°
kcal/mole
IC50
nM
Kd
nM
EC50/IC50
nM
koff
s-1
kon
M-1s-1
pHTemp
°C
nucleotide-binding oligomerization domain containing 2
(Homo sapiens (Human))
BDBM54226
((3-amino-7-methoxy-1-pyrazolo[3,4-b]quinolinyl)-(4...)
Show SMILES COc1ccc2cc3c(N)nn(C(=O)c4ccc(Cl)c(c4)[N+]([O-])=O)c3nc2c1
Show InChI InChI=1S/C18H12ClN5O4/c1-28-11-4-2-9-6-12-16(20)22-23(17(12)21-14(9)8-11)18(25)10-3-5-13(19)15(7-10)24(26)27/h2-8H,1H3,(H2,20,22)
Reactome pathway
PCBioAssay
n/an/a 2.29E+3n/an/an/an/an/an/a
Burnham Center for Chemical Genomics
Curated by PubChem BioAssay
Assay Description
Data Source: Sanford-Burnham Center for Chemical Genomics (SBCCG) Source Affiliation: Sanford-Burnham Medical Research Institute (SBMRI, San Diego, C...
PubChem Bioassay (2010)
BindingDB Entry DOI: 10.7270/Q23R0R8T
neuronal munc18-1 binding protein
(Rattus norvegicus)
BDBM54226
((3-amino-7-methoxy-1-pyrazolo[3,4-b]quinolinyl)-(4...)
Show SMILES COc1ccc2cc3c(N)nn(C(=O)c4ccc(Cl)c(c4)[N+]([O-])=O)c3nc2c1
Show InChI InChI=1S/C18H12ClN5O4/c1-28-11-4-2-9-6-12-16(20)22-23(17(12)21-14(9)8-11)18(25)10-3-5-13(19)15(7-10)24(26)27/h2-8H,1H3,(H2,20,22)
PCBioAssay
n/an/a 2.87E+4n/an/an/an/an/an/a
Burnham Center for Chemical Genomics
Curated by PubChem BioAssay
Assay Description
Data Source: Sanford-Burnham Center for Chemical Genomics (SBCCG) Source Affiliation: Sanford-Burnham Medical Research Institute (SBMRI, San Diego, C...
PubChem Bioassay (2009)
BindingDB Entry DOI: 10.7270/Q20P0XFH
carboxy-terminal domain RNA polymerase II polypeptide A small phosphatase 1 isoform 1
(Homo sapiens (Human))
BDBM54226
((3-amino-7-methoxy-1-pyrazolo[3,4-b]quinolinyl)-(4...)
Show SMILES COc1ccc2cc3c(N)nn(C(=O)c4ccc(Cl)c(c4)[N+]([O-])=O)c3nc2c1
Show InChI InChI=1S/C18H12ClN5O4/c1-28-11-4-2-9-6-12-16(20)22-23(17(12)21-14(9)8-11)18(25)10-3-5-13(19)15(7-10)24(26)27/h2-8H,1H3,(H2,20,22)
PCBioAssay
n/an/a 1.72E+3n/an/an/an/an/an/a
Burnham Center for Chemical Genomics
Curated by PubChem BioAssay
Assay Description
Data Source: Sanford-Burnham Center for Chemical Genomics (SBCCG) Source Affiliation: Sanford-Burnham Medical Research Institute (SBMRI, San Diego, C...
PubChem Bioassay (2011)
BindingDB Entry DOI: 10.7270/Q2V986KM
nucleotide-binding oligomerization domain containing 1
(Homo sapiens (Human))
BDBM54226
((3-amino-7-methoxy-1-pyrazolo[3,4-b]quinolinyl)-(4...)
Show SMILES COc1ccc2cc3c(N)nn(C(=O)c4ccc(Cl)c(c4)[N+]([O-])=O)c3nc2c1
Show InChI InChI=1S/C18H12ClN5O4/c1-28-11-4-2-9-6-12-16(20)22-23(17(12)21-14(9)8-11)18(25)10-3-5-13(19)15(7-10)24(26)27/h2-8H,1H3,(H2,20,22)
Reactome pathway
PCBioAssay
n/an/an/an/a 3.50E+3n/an/an/an/a
Burnham Center for Chemical Genomics
Curated by PubChem BioAssay
Assay Description
Data Source: Sanford-Burnham Center for Chemical Genomics (SBCCG) Source Affiliation: Sanford-Burnham Medical Research Institute (SBMRI, San Diego, C...
PubChem Bioassay (2010)
BindingDB Entry DOI: 10.7270/Q2CN72C0
Tumor necrosis factor
(Homo sapiens (Human))
BDBM54226
((3-amino-7-methoxy-1-pyrazolo[3,4-b]quinolinyl)-(4...)
Show SMILES COc1ccc2cc3c(N)nn(C(=O)c4ccc(Cl)c(c4)[N+]([O-])=O)c3nc2c1
Show InChI InChI=1S/C18H12ClN5O4/c1-28-11-4-2-9-6-12-16(20)22-23(17(12)21-14(9)8-11)18(25)10-3-5-13(19)15(7-10)24(26)27/h2-8H,1H3,(H2,20,22)
Reactome pathway
PCBioAssay
n/an/a 1.71E+3n/an/an/an/an/an/a
Burnham Center for Chemical Genomics
Curated by PubChem BioAssay
Assay Description
Data Source: Sanford-Burnham Center for Chemical Genomics (SBCCG) Source Affiliation: Sanford-Burnham Medical Research Institute (SBMRI, San Diego, C...
PubChem Bioassay (2010)
BindingDB Entry DOI: 10.7270/Q25M6443
Voltage-gated calcium channel subunit alpha Cav2.2
(Homo sapiens (Human))
BDBM54226
((3-amino-7-methoxy-1-pyrazolo[3,4-b]quinolinyl)-(4...)
Show SMILES COc1ccc2cc3c(N)nn(C(=O)c4ccc(Cl)c(c4)[N+]([O-])=O)c3nc2c1
Show InChI InChI=1S/C18H12ClN5O4/c1-28-11-4-2-9-6-12-16(20)22-23(17(12)21-14(9)8-11)18(25)10-3-5-13(19)15(7-10)24(26)27/h2-8H,1H3,(H2,20,22)
PCBioAssay
n/an/a 1.61E+4n/an/an/an/an/an/a
Burnham Center for Chemical Genomics
Curated by PubChem BioAssay
Assay Description
Data Source: Data Source: Sanford-Burnham Center for Chemical Genomics (SBCCG) Source Affiliation: Sanford-Burnham Medical Research Institute Network...
PubChem Bioassay (2009)
BindingDB Entry DOI: 10.7270/Q2PZ578V