BDBM5459 6-alkoxy-4-anilinoquinazoline 8e::N-{3-chloro-4-[(3-fluorophenyl)methoxy]phenyl}-6-{4-[(2-methanesulfonylethyl)amino]butoxy}quinazolin-4-amine
SMILES: CS(=O)(=O)CCNCCCCOc1ccc2ncnc(Nc3ccc(OCc4cccc(F)c4)c(Cl)c3)c2c1
InChI Key: InChIKey=FUAWEXVTNBAJGV-UHFFFAOYSA-N
Data: 2 IC50
Activity Spreadsheet -- Enzyme Inhibition Constant Data from BindingDB
Found 2 hits for monomerid = 5459
Trg + Lig
Ki
nM
ΔG°
kcal/mole
IC50
nM
Kd
nM
EC50/IC50
nM
koff
s-1
kon
M-1s-1
pHTemp
°C
Receptor tyrosine-protein kinase erbB-2
(Homo sapiens (Human))
BDBM5459
(6-alkoxy-4-anilinoquinazoline 8e | N-{3-chloro-4-[...)
Show SMILES CS(=O)(=O)CCNCCCCOc1ccc2ncnc(Nc3ccc(OCc4cccc(F)c4)c(Cl)c3)c2c1
Show InChI InChI=1S/C28H30ClFN4O4S/c1-39(35,36)14-12-31-11-2-3-13-37-23-8-9-26-24(17-23)28(33-19-32-26)34-22-7-10-27(25(29)16-22)38-18-20-5-4-6-21(30)15-20/h4-10,15-17,19,31H,2-3,11-14,18H2,1H3,(H,32,33,34)
n/an/a 10n/an/an/an/a7.523
GlaxoSmithKline
Assay Description
Enzymatic reactions were initiated by adding kinase to the reaction mixture containing ATP, [gamma-33P] ATP, peptide substrate and test inhibitor com...
Bioorg Med Chem Lett 13: 637-40 (2003)
Article DOI: 10.1016/s0960-894x(02)01047-8
BindingDB Entry DOI: 10.7270/Q2D21VS2
Epidermal growth factor receptor
(Homo sapiens (Human))
BDBM5459
(6-alkoxy-4-anilinoquinazoline 8e | N-{3-chloro-4-[...)
Show SMILES CS(=O)(=O)CCNCCCCOc1ccc2ncnc(Nc3ccc(OCc4cccc(F)c4)c(Cl)c3)c2c1
Show InChI InChI=1S/C28H30ClFN4O4S/c1-39(35,36)14-12-31-11-2-3-13-37-23-8-9-26-24(17-23)28(33-19-32-26)34-22-7-10-27(25(29)16-22)38-18-20-5-4-6-21(30)15-20/h4-10,15-17,19,31H,2-3,11-14,18H2,1H3,(H,32,33,34)
n/an/a 27n/an/an/an/a7.523
GlaxoSmithKline
Assay Description
Enzymatic reactions were initiated by adding kinase to the reaction mixture containing ATP, [gamma-33P] ATP, peptide substrate and test inhibitor com...
Bioorg Med Chem Lett 13: 637-40 (2003)
Article DOI: 10.1016/s0960-894x(02)01047-8
BindingDB Entry DOI: 10.7270/Q2D21VS2