BDBM54621 1-(2-fluorophenyl)-5-(4-fluorophenyl)-3-(4-methoxyphenyl)-2-pyrazoline::2-(2-fluorophenyl)-3-(4-fluorophenyl)-5-(4-methoxyphenyl)-3,4-dihydropyrazole::UNM-0000305860::cid_2883090
SMILES: COc1ccc(cc1)C1=NN(C(C1)c1ccc(F)cc1)c1ccccc1F
InChI Key: InChIKey=MTIDYGMOONZOIQ-UHFFFAOYSA-N
Data: 1 KI  8 EC50
Activity Spreadsheet -- Enzyme Inhibition Constant Data from BindingDB
Found 9 hits for monomerid = 54621
Trg + Lig
Ki
nM
ΔG°
kcal/mole
IC50
nM
Kd
nM
EC50/IC50
nM
koff
s-1
kon
M-1s-1
pHTemp
°C
ras protein
(Homo sapiens (Human))
BDBM54621
(1-(2-fluorophenyl)-5-(4-fluorophenyl)-3-(4-methoxy...)
Show SMILES COc1ccc(cc1)C1=NN(C(C1)c1ccc(F)cc1)c1ccccc1F |t:9|
Show InChI InChI=1S/C22H18F2N2O/c1-27-18-12-8-15(9-13-18)20-14-22(16-6-10-17(23)11-7-16)26(25-20)21-5-3-2-4-19(21)24/h2-13,22H,14H2,1H3
PCBioAssay
2.11E+3n/an/an/an/an/an/an/an/a
NMMLSC
Curated by PubChem BioAssay
Assay Description
University of New Mexico Assay Overview: Assay Support: NIH I RO3 MH081231-01 HTS to identify specific small molecule inhibitors of Ras and Ras-rela...
PubChem Bioassay (2009)
BindingDB Entry DOI: 10.7270/Q2FX77VQ
ras protein
(Homo sapiens (Human))
BDBM54621
(1-(2-fluorophenyl)-5-(4-fluorophenyl)-3-(4-methoxy...)
Show SMILES COc1ccc(cc1)C1=NN(C(C1)c1ccc(F)cc1)c1ccccc1F |t:9|
Show InChI InChI=1S/C22H18F2N2O/c1-27-18-12-8-15(9-13-18)20-14-22(16-6-10-17(23)11-7-16)26(25-20)21-5-3-2-4-19(21)24/h2-13,22H,14H2,1H3
PCBioAssay
n/an/an/an/a 1.35E+4n/an/an/an/a
NMMLSC
Curated by PubChem BioAssay
Assay Description
University of New Mexico Assay Overview: Assay Support: NIH I RO3 MH081231-01 HTS to identify specific small molecule inhibitors of Ras and Ras-rela...
PubChem Bioassay (2009)
BindingDB Entry DOI: 10.7270/Q2KK9971
Ras-related C3 botulinum toxin substrate 1
(Mus musculus)
BDBM54621
(1-(2-fluorophenyl)-5-(4-fluorophenyl)-3-(4-methoxy...)
Show SMILES COc1ccc(cc1)C1=NN(C(C1)c1ccc(F)cc1)c1ccccc1F |t:9|
Show InChI InChI=1S/C22H18F2N2O/c1-27-18-12-8-15(9-13-18)20-14-22(16-6-10-17(23)11-7-16)26(25-20)21-5-3-2-4-19(21)24/h2-13,22H,14H2,1H3
Reactome pathway
PCBioAssay
n/an/an/an/a 3.00E+4n/an/an/an/a
NMMLSC
Curated by PubChem BioAssay
Assay Description
University of New Mexico Assay Overview: Assay Support: NIH I RO3 MH081231-01 HTS to identify specific small molecule inhibitors of Ras and Ras-rela...
PubChem Bioassay (2009)
BindingDB Entry DOI: 10.7270/Q2B56H55
GTP-binding protein (rab7)
(Canis lupus familiaris)
BDBM54621
(1-(2-fluorophenyl)-5-(4-fluorophenyl)-3-(4-methoxy...)
Show SMILES COc1ccc(cc1)C1=NN(C(C1)c1ccc(F)cc1)c1ccccc1F |t:9|
Show InChI InChI=1S/C22H18F2N2O/c1-27-18-12-8-15(9-13-18)20-14-22(16-6-10-17(23)11-7-16)26(25-20)21-5-3-2-4-19(21)24/h2-13,22H,14H2,1H3
Reactome pathway
PCBioAssay
n/an/an/an/a 3.00E+4n/an/an/an/a
NMMLSC
Curated by PubChem BioAssay
Assay Description
University of New Mexico Assay Overview: Assay Support: NIH I RO3 MH081231-01 HTS to identify specific small molecule inhibitors of Ras and Ras-rela...
PubChem Bioassay (2009)
BindingDB Entry DOI: 10.7270/Q2MK6B9H
Ras-related C3 botulinum toxin substrate 1
(Mus musculus)
BDBM54621
(1-(2-fluorophenyl)-5-(4-fluorophenyl)-3-(4-methoxy...)
Show SMILES COc1ccc(cc1)C1=NN(C(C1)c1ccc(F)cc1)c1ccccc1F |t:9|
Show InChI InChI=1S/C22H18F2N2O/c1-27-18-12-8-15(9-13-18)20-14-22(16-6-10-17(23)11-7-16)26(25-20)21-5-3-2-4-19(21)24/h2-13,22H,14H2,1H3
Reactome pathway
PCBioAssay
n/an/an/an/a 3.00E+4n/an/an/an/a
NMMLSC
Curated by PubChem BioAssay
Assay Description
University of New Mexico Assay Overview: Assay Support: NIH I RO3 MH081231-01 HTS to identify specific small molecule inhibitors of Ras and Ras-rela...
PubChem Bioassay (2009)
BindingDB Entry DOI: 10.7270/Q2959G0B
cell division cycle 42 (GTP binding protein, 25kDa)
(Homo sapiens (Human))
BDBM54621
(1-(2-fluorophenyl)-5-(4-fluorophenyl)-3-(4-methoxy...)
Show SMILES COc1ccc(cc1)C1=NN(C(C1)c1ccc(F)cc1)c1ccccc1F |t:9|
Show InChI InChI=1S/C22H18F2N2O/c1-27-18-12-8-15(9-13-18)20-14-22(16-6-10-17(23)11-7-16)26(25-20)21-5-3-2-4-19(21)24/h2-13,22H,14H2,1H3
NCI pathway
Reactome pathway
PCBioAssay
n/an/an/an/a 3.00E+4n/an/an/an/a
NMMLSC
Curated by PubChem BioAssay
Assay Description
University of New Mexico Assay Overview: Assay Support: NIH I RO3 MH081231-01 HTS to identify specific small molecule inhibitors of Ras and Ras-rela...
PubChem Bioassay (2009)
BindingDB Entry DOI: 10.7270/Q2QJ7FRJ
cell division cycle 42 (GTP binding protein, 25kDa)
(Homo sapiens (Human))
BDBM54621
(1-(2-fluorophenyl)-5-(4-fluorophenyl)-3-(4-methoxy...)
Show SMILES COc1ccc(cc1)C1=NN(C(C1)c1ccc(F)cc1)c1ccccc1F |t:9|
Show InChI InChI=1S/C22H18F2N2O/c1-27-18-12-8-15(9-13-18)20-14-22(16-6-10-17(23)11-7-16)26(25-20)21-5-3-2-4-19(21)24/h2-13,22H,14H2,1H3
NCI pathway
Reactome pathway
PCBioAssay
n/an/an/an/a 3.00E+4n/an/an/an/a
NMMLSC
Curated by PubChem BioAssay
Assay Description
University of New Mexico Assay Overview: Assay Support: NIH I RO3 MH081231-01 HTS to identify specific small molecule inhibitors of Ras and Ras-rela...
PubChem Bioassay (2009)
BindingDB Entry DOI: 10.7270/Q2G15Z8C
Ras-related protein Rab-2A.
(Canis lupus familiaris)
BDBM54621
(1-(2-fluorophenyl)-5-(4-fluorophenyl)-3-(4-methoxy...)
Show SMILES COc1ccc(cc1)C1=NN(C(C1)c1ccc(F)cc1)c1ccccc1F |t:9|
Show InChI InChI=1S/C22H18F2N2O/c1-27-18-12-8-15(9-13-18)20-14-22(16-6-10-17(23)11-7-16)26(25-20)21-5-3-2-4-19(21)24/h2-13,22H,14H2,1H3
Reactome pathway
PCBioAssay
n/an/an/an/a 3.00E+4n/an/an/an/a
NMMLSC
Curated by PubChem BioAssay
Assay Description
University of New Mexico Assay Overview: Assay Support: NIH I RO3 MH081231-01 HTS to identify specific small molecule inhibitors of Ras and Ras-rela...
PubChem Bioassay (2016)
BindingDB Entry DOI: 10.7270/Q2ZW1JC6
ras protein
(Homo sapiens (Human))
BDBM54621
(1-(2-fluorophenyl)-5-(4-fluorophenyl)-3-(4-methoxy...)
Show SMILES COc1ccc(cc1)C1=NN(C(C1)c1ccc(F)cc1)c1ccccc1F |t:9|
Show InChI InChI=1S/C22H18F2N2O/c1-27-18-12-8-15(9-13-18)20-14-22(16-6-10-17(23)11-7-16)26(25-20)21-5-3-2-4-19(21)24/h2-13,22H,14H2,1H3
PCBioAssay
n/an/an/an/a 3.00E+4n/an/an/an/a
NMMLSC
Curated by PubChem BioAssay
Assay Description
University of New Mexico Assay Overview: Assay Support: NIH I RO3 MH081231-01 HTS to identify specific small molecule inhibitors of Ras and Ras-rela...
PubChem Bioassay (2009)
BindingDB Entry DOI: 10.7270/Q22N50Q3