BDBM54661 4-[3-(4-methoxyphenyl)-5-methyl-3,4-dihydropyrazol-2-yl]benzenesulfonamide::4-[5-(4-methoxyphenyl)-3-methyl-2-pyrazolin-1-yl]benzenesulfonamide::KUC103440N::UNM-0000306159::cid_14870296
SMILES: COc1ccc(cc1)C1CC(C)=NN1c1ccc(cc1)S(N)(=O)=O
InChI Key: InChIKey=BQYIJYRLZDWYAH-UHFFFAOYSA-N
Data: 1 KI  8 EC50
Activity Spreadsheet -- Enzyme Inhibition Constant Data from BindingDB
Found 9 hits for monomerid = 54661
Trg + Lig
Ki
nM
ΔG°
kcal/mole
IC50
nM
Kd
nM
EC50/IC50
nM
koff
s-1
kon
M-1s-1
pHTemp
°C
Ras-related C3 botulinum toxin substrate 1
(Mus musculus)
BDBM54661
(4-[3-(4-methoxyphenyl)-5-methyl-3,4-dihydropyrazol...)
Show SMILES COc1ccc(cc1)C1CC(C)=NN1c1ccc(cc1)S(N)(=O)=O |c:12|
Show InChI InChI=1S/C17H19N3O3S/c1-12-11-17(13-3-7-15(23-2)8-4-13)20(19-12)14-5-9-16(10-6-14)24(18,21)22/h3-10,17H,11H2,1-2H3,(H2,18,21,22)
Reactome pathway
PCBioAssay
10n/an/an/an/an/an/an/an/a
NMMLSC
Curated by PubChem BioAssay
Assay Description
University of New Mexico Assay Overview: Assay Support: NIH I RO3 MH081231-01 HTS to identify specific small molecule inhibitors of Ras and Ras-rela...
PubChem Bioassay (2009)
BindingDB Entry DOI: 10.7270/Q26D5RFF
ras protein
(Homo sapiens (Human))
BDBM54661
(4-[3-(4-methoxyphenyl)-5-methyl-3,4-dihydropyrazol...)
Show SMILES COc1ccc(cc1)C1CC(C)=NN1c1ccc(cc1)S(N)(=O)=O |c:12|
Show InChI InChI=1S/C17H19N3O3S/c1-12-11-17(13-3-7-15(23-2)8-4-13)20(19-12)14-5-9-16(10-6-14)24(18,21)22/h3-10,17H,11H2,1-2H3,(H2,18,21,22)
PCBioAssay
n/an/an/an/a 3.00E+4n/an/an/an/a
NMMLSC
Curated by PubChem BioAssay
Assay Description
University of New Mexico Assay Overview: Assay Support: NIH I RO3 MH081231-01 HTS to identify specific small molecule inhibitors of Ras and Ras-rela...
PubChem Bioassay (2009)
BindingDB Entry DOI: 10.7270/Q2KK9971
Ras-related C3 botulinum toxin substrate 1
(Mus musculus)
BDBM54661
(4-[3-(4-methoxyphenyl)-5-methyl-3,4-dihydropyrazol...)
Show SMILES COc1ccc(cc1)C1CC(C)=NN1c1ccc(cc1)S(N)(=O)=O |c:12|
Show InChI InChI=1S/C17H19N3O3S/c1-12-11-17(13-3-7-15(23-2)8-4-13)20(19-12)14-5-9-16(10-6-14)24(18,21)22/h3-10,17H,11H2,1-2H3,(H2,18,21,22)
Reactome pathway
PCBioAssay
n/an/an/an/a 63n/an/an/an/a
NMMLSC
Curated by PubChem BioAssay
Assay Description
University of New Mexico Assay Overview: Assay Support: NIH I RO3 MH081231-01 HTS to identify specific small molecule inhibitors of Ras and Ras-rela...
PubChem Bioassay (2009)
BindingDB Entry DOI: 10.7270/Q2B56H55
GTP-binding protein (rab7)
(Canis lupus familiaris)
BDBM54661
(4-[3-(4-methoxyphenyl)-5-methyl-3,4-dihydropyrazol...)
Show SMILES COc1ccc(cc1)C1CC(C)=NN1c1ccc(cc1)S(N)(=O)=O |c:12|
Show InChI InChI=1S/C17H19N3O3S/c1-12-11-17(13-3-7-15(23-2)8-4-13)20(19-12)14-5-9-16(10-6-14)24(18,21)22/h3-10,17H,11H2,1-2H3,(H2,18,21,22)
Reactome pathway
PCBioAssay
n/an/an/an/a 3.00E+4n/an/an/an/a
NMMLSC
Curated by PubChem BioAssay
Assay Description
University of New Mexico Assay Overview: Assay Support: NIH I RO3 MH081231-01 HTS to identify specific small molecule inhibitors of Ras and Ras-rela...
PubChem Bioassay (2009)
BindingDB Entry DOI: 10.7270/Q2MK6B9H
Ras-related C3 botulinum toxin substrate 1
(Mus musculus)
BDBM54661
(4-[3-(4-methoxyphenyl)-5-methyl-3,4-dihydropyrazol...)
Show SMILES COc1ccc(cc1)C1CC(C)=NN1c1ccc(cc1)S(N)(=O)=O |c:12|
Show InChI InChI=1S/C17H19N3O3S/c1-12-11-17(13-3-7-15(23-2)8-4-13)20(19-12)14-5-9-16(10-6-14)24(18,21)22/h3-10,17H,11H2,1-2H3,(H2,18,21,22)
Reactome pathway
PCBioAssay
n/an/an/an/a 3.00E+4n/an/an/an/a
NMMLSC
Curated by PubChem BioAssay
Assay Description
University of New Mexico Assay Overview: Assay Support: NIH I RO3 MH081231-01 HTS to identify specific small molecule inhibitors of Ras and Ras-rela...
PubChem Bioassay (2009)
BindingDB Entry DOI: 10.7270/Q2959G0B
cell division cycle 42 (GTP binding protein, 25kDa)
(Homo sapiens (Human))
BDBM54661
(4-[3-(4-methoxyphenyl)-5-methyl-3,4-dihydropyrazol...)
Show SMILES COc1ccc(cc1)C1CC(C)=NN1c1ccc(cc1)S(N)(=O)=O |c:12|
Show InChI InChI=1S/C17H19N3O3S/c1-12-11-17(13-3-7-15(23-2)8-4-13)20(19-12)14-5-9-16(10-6-14)24(18,21)22/h3-10,17H,11H2,1-2H3,(H2,18,21,22)
NCI pathway
Reactome pathway
PCBioAssay
n/an/an/an/a 3.00E+4n/an/an/an/a
NMMLSC
Curated by PubChem BioAssay
Assay Description
University of New Mexico Assay Overview: Assay Support: NIH I RO3 MH081231-01 HTS to identify specific small molecule inhibitors of Ras and Ras-rela...
PubChem Bioassay (2009)
BindingDB Entry DOI: 10.7270/Q2QJ7FRJ
cell division cycle 42 (GTP binding protein, 25kDa)
(Homo sapiens (Human))
BDBM54661
(4-[3-(4-methoxyphenyl)-5-methyl-3,4-dihydropyrazol...)
Show SMILES COc1ccc(cc1)C1CC(C)=NN1c1ccc(cc1)S(N)(=O)=O |c:12|
Show InChI InChI=1S/C17H19N3O3S/c1-12-11-17(13-3-7-15(23-2)8-4-13)20(19-12)14-5-9-16(10-6-14)24(18,21)22/h3-10,17H,11H2,1-2H3,(H2,18,21,22)
NCI pathway
Reactome pathway
PCBioAssay
n/an/an/an/a 3.00E+4n/an/an/an/a
NMMLSC
Curated by PubChem BioAssay
Assay Description
University of New Mexico Assay Overview: Assay Support: NIH I RO3 MH081231-01 HTS to identify specific small molecule inhibitors of Ras and Ras-rela...
PubChem Bioassay (2009)
BindingDB Entry DOI: 10.7270/Q2G15Z8C
Ras-related protein Rab-2A.
(Canis lupus familiaris)
BDBM54661
(4-[3-(4-methoxyphenyl)-5-methyl-3,4-dihydropyrazol...)
Show SMILES COc1ccc(cc1)C1CC(C)=NN1c1ccc(cc1)S(N)(=O)=O |c:12|
Show InChI InChI=1S/C17H19N3O3S/c1-12-11-17(13-3-7-15(23-2)8-4-13)20(19-12)14-5-9-16(10-6-14)24(18,21)22/h3-10,17H,11H2,1-2H3,(H2,18,21,22)
Reactome pathway
PCBioAssay
n/an/an/an/a 3.00E+4n/an/an/an/a
NMMLSC
Curated by PubChem BioAssay
Assay Description
University of New Mexico Assay Overview: Assay Support: NIH I RO3 MH081231-01 HTS to identify specific small molecule inhibitors of Ras and Ras-rela...
PubChem Bioassay (2016)
BindingDB Entry DOI: 10.7270/Q2ZW1JC6
ras protein
(Homo sapiens (Human))
BDBM54661
(4-[3-(4-methoxyphenyl)-5-methyl-3,4-dihydropyrazol...)
Show SMILES COc1ccc(cc1)C1CC(C)=NN1c1ccc(cc1)S(N)(=O)=O |c:12|
Show InChI InChI=1S/C17H19N3O3S/c1-12-11-17(13-3-7-15(23-2)8-4-13)20(19-12)14-5-9-16(10-6-14)24(18,21)22/h3-10,17H,11H2,1-2H3,(H2,18,21,22)
PCBioAssay
n/an/an/an/a 3.00E+4n/an/an/an/a
NMMLSC
Curated by PubChem BioAssay
Assay Description
University of New Mexico Assay Overview: Assay Support: NIH I RO3 MH081231-01 HTS to identify specific small molecule inhibitors of Ras and Ras-rela...
PubChem Bioassay (2009)
BindingDB Entry DOI: 10.7270/Q22N50Q3