null
SMILES: Brc1ccc(C=CC(=O)OCc2nc3ccsc3c(=O)[nH]2)o1
InChI Key: InChIKey=ZBYAFUVXGBOBGO-UHFFFAOYSA-N
Activity Spreadsheet -- Enzyme Inhibition Constant Data from BindingDB
Found 1 hit for monomerid = 55004
Trg + Lig
Ki
nM
ΔG°
kcal/mole
IC50
nM
Kd
nM
EC50/IC50
nM
koff
s-1
kon
M-1s-1
pHTemp
°C
Core protein
(Hepatitis C virus)
BDBM55004
((4-oxidanylidene-1H-thieno[3,2-d]pyrimidin-2-yl)me...)
Show SMILES Brc1ccc(C=CC(=O)OCc2nc3ccsc3c(=O)[nH]2)o1 |w:5.4|
Show InChI InChI=1S/C14H9BrN2O4S/c15-10-3-1-8(21-10)2-4-12(18)20-7-11-16-9-5-6-22-13(9)14(19)17-11/h1-6H,7H2,(H,16,17,19)
PCBioAssay
n/an/a 1.82E+4n/an/an/an/an/an/a
The Scripps Research Institute Molecular Screening Center
Curated by PubChem BioAssay
Assay Description
Source (MLPCN Center Name): The Scripps Research Institute Molecular Screening Center Affiliation: The Scripps Research Institute, TSRI Assay Provide...
PubChem Bioassay (2009)
BindingDB Entry DOI: 10.7270/Q29Z939R