null
SMILES: CC1(C)CC(=O)N(C1=O)c1ccc(NC(=O)c2ccccn2)cc1Cl
InChI Key: InChIKey=VMKVEFRKXCKLPA-UHFFFAOYSA-N
Activity Spreadsheet -- Enzyme Inhibition Constant Data from BindingDB
Found 3 hits for monomerid = 55092
Trg + Lig
Ki
nM
ΔG°
kcal/mole
IC50
nM
Kd
nM
EC50/IC50
nM
koff
s-1
kon
M-1s-1
pHTemp
°C
Metabotropic glutamate receptor 4
(Homo sapiens (Human))
BDBM55092
(N-[3-chloranyl-4-[3,3-dimethyl-2,5-bis(oxidanylide...)
Show SMILES CC1(C)CC(=O)N(C1=O)c1ccc(NC(=O)c2ccccn2)cc1Cl
Show InChI InChI=1S/C18H16ClN3O3/c1-18(2)10-15(23)22(17(18)25)14-7-6-11(9-12(14)19)21-16(24)13-5-3-4-8-20-13/h3-9H,10H2,1-2H3,(H,21,24)
PCBioAssay
n/an/an/an/a 1.48E+3n/an/an/an/a
Vanderbilt Screening Center for GPCRs, Ion Channels and Transporters
Curated by PubChem BioAssay
Assay Description
Assay Provider: Colleen Niswender Assay Provider Affiliation: Vanderbilt University The primary pathophysiological change giving rise to the symptoms...
PubChem Bioassay (2010)
BindingDB Entry DOI: 10.7270/Q2VT1QHF
Metabotropic glutamate receptor 4
(Homo sapiens (Human))
BDBM55092
(N-[3-chloranyl-4-[3,3-dimethyl-2,5-bis(oxidanylide...)
Show SMILES CC1(C)CC(=O)N(C1=O)c1ccc(NC(=O)c2ccccn2)cc1Cl
Show InChI InChI=1S/C18H16ClN3O3/c1-18(2)10-15(23)22(17(18)25)14-7-6-11(9-12(14)19)21-16(24)13-5-3-4-8-20-13/h3-9H,10H2,1-2H3,(H,21,24)
n/an/an/an/a 1.40E+3n/an/an/an/a
Vanderbilt University Medical Center
Curated by ChEMBL
Assay Description
Positive allosteric modulator activity at human mGlu4 receptor expressed in CHO cells expressing Gqi5 by calcium mobilization assay
J Med Chem 54: 7639-47 (2011)
Article DOI: 10.1021/jm200956q
BindingDB Entry DOI: 10.7270/Q25Q4WHD
Metabotropic glutamate receptor 4 [Q124R]
(Rattus norvegicus)
BDBM55092
(N-[3-chloranyl-4-[3,3-dimethyl-2,5-bis(oxidanylide...)
Show SMILES CC1(C)CC(=O)N(C1=O)c1ccc(NC(=O)c2ccccn2)cc1Cl
Show InChI InChI=1S/C18H16ClN3O3/c1-18(2)10-15(23)22(17(18)25)14-7-6-11(9-12(14)19)21-16(24)13-5-3-4-8-20-13/h3-9H,10H2,1-2H3,(H,21,24)
PCBioAssay
n/an/an/an/a 2.32E+3n/an/an/an/a
Vanderbilt Screening Center for GPCRs, Ion Channels and Transporters
Curated by PubChem BioAssay
Assay Description
Assay Provider: Colleen Niswender Assay Provider Affiliation: Vanderbilt University The primary pathophysiological change giving rise to the symptoms...
PubChem Bioassay (2010)
BindingDB Entry DOI: 10.7270/Q2DR2SWV