BDBM5523 6-(cyclohexylmethoxy)-N-ethyl-9H-purin-2-amine::6-Cyclohexylmethoxy-2-(ethylamino)purine::O6-Cyclohexylmethylguanine deriv. 8
SMILES: CCNc1nc(OCC2CCCCC2)c2[nH]cnc2n1
InChI Key: InChIKey=MYZLUBKSKAQOHZ-UHFFFAOYSA-N
Data: 2 IC50
PDB links: 2 PDB IDs contain inhibitors having a similarity of 90% to this monomer.
Activity Spreadsheet -- Enzyme Inhibition Constant Data from BindingDB
Found 2 hits for monomerid = 5523
Trg + Lig
Ki
nM
ΔG°
kcal/mole
IC50
nM
Kd
nM
EC50/IC50
nM
koff
s-1
kon
M-1s-1
pHTemp
°C
Cyclin-Dependent Kinase 2 (CDK2)
(Homo sapiens (Human))
BDBM5523
(6-(cyclohexylmethoxy)-N-ethyl-9H-purin-2-amine | 6...)
Show SMILES CCNc1nc(OCC2CCCCC2)c2[nH]cnc2n1
Show InChI InChI=1S/C14H21N5O/c1-2-15-14-18-12-11(16-9-17-12)13(19-14)20-8-10-6-4-3-5-7-10/h9-10H,2-8H2,1H3,(H2,15,16,17,18,19)
NCI pathway
Reactome pathway
n/an/a 2.80E+3n/an/an/an/a7.530
University of Newcastle
Assay Description
The enzyme was assayed with substrate histone H1 in the presence of 12.5 uM ATP/[gamma-32P] ATP. IC50 is the inhibitor concentration, which inhibits ...
J Med Chem 47: 3710-22 (2004)
Article DOI: 10.1021/jm0311442
BindingDB Entry DOI: 10.7270/Q24J0C9Z
Cyclin-Dependent Kinase 1 (CDK1)
(Marthasterias glacialis (starfish))
BDBM5523
(6-(cyclohexylmethoxy)-N-ethyl-9H-purin-2-amine | 6...)
Show SMILES CCNc1nc(OCC2CCCCC2)c2[nH]cnc2n1
Show InChI InChI=1S/C14H21N5O/c1-2-15-14-18-12-11(16-9-17-12)13(19-14)20-8-10-6-4-3-5-7-10/h9-10H,2-8H2,1H3,(H2,15,16,17,18,19)
n/an/a 3.30E+3n/an/an/an/a7.530
University of Newcastle
Assay Description
The enzyme was assayed with substrate histone H1 in the presence of 12.5 uM ATP/[gamma-32P] ATP. IC50 is the inhibitor concentration, which inhibits ...
J Med Chem 47: 3710-22 (2004)
Article DOI: 10.1021/jm0311442
BindingDB Entry DOI: 10.7270/Q24J0C9Z