null
SMILES: CCc1nc2ccc(CN3CCN(CC3)c3ccc(nc3C(F)F)C(=O)NC)cc2[nH]c1=O
InChI Key:
Activity Spreadsheet -- Enzyme Inhibition Constant Data from BindingDB
Found 6 hits for monomerid = 553946
Trg + Lig
Ki
nM
ΔG°
kcal/mole
IC50
nM
Kd
nM
EC50/IC50
nM
koff
s-1
kon
M-1s-1
pHTemp
°C
Poly [ADP-ribose] polymerase 1
(Homo sapiens (Human))
BDBM553946
(US11325906, Example 10)
Show SMILES CCc1nc2ccc(CN3CCN(CC3)c3ccc(nc3C(F)F)C(=O)NC)cc2[nH]c1=O
n/an/a 5n/an/an/an/an/an/a
TBA
Citation and Details
Poly [ADP-ribose] polymerase 2
(Homo sapiens (Human))
BDBM553946
(US11325906, Example 10)
Show SMILES CCc1nc2ccc(CN3CCN(CC3)c3ccc(nc3C(F)F)C(=O)NC)cc2[nH]c1=O
n/an/a 1.70E+4n/an/an/an/an/an/a
TBA
Citation and Details
Potassium voltage-gated channel subfamily H member 2
(Homo sapiens (Human))
BDBM553946
(US11325906, Example 10)
Show SMILES CCc1nc2ccc(CN3CCN(CC3)c3ccc(nc3C(F)F)C(=O)NC)cc2[nH]c1=O
Reactome pathway
n/an/a>4.00E+4n/an/an/an/an/an/a
TBA
Citation and Details
Poly [ADP-ribose] polymerase tankyrase-1
(Homo sapiens (Human))
BDBM553946
(US11325906, Example 10)
Show SMILES CCc1nc2ccc(CN3CCN(CC3)c3ccc(nc3C(F)F)C(=O)NC)cc2[nH]c1=O
n/an/a 5.60E+4n/an/an/an/an/an/a
TBA
Citation and Details
Protein mono-ADP-ribosyltransferase PARP6
(Homo sapiens (Human))
BDBM553946
(US11325906, Example 10)
Show SMILES CCc1nc2ccc(CN3CCN(CC3)c3ccc(nc3C(F)F)C(=O)NC)cc2[nH]c1=O
n/an/a 2.60E+4n/an/an/an/an/an/a
TBA
Citation and Details
Protein mono-ADP-ribosyltransferase PARP3
(Homo sapiens (Human))
BDBM553946
(US11325906, Example 10)
Show SMILES CCc1nc2ccc(CN3CCN(CC3)c3ccc(nc3C(F)F)C(=O)NC)cc2[nH]c1=O
n/an/a 4.80E+4n/an/an/an/an/an/a
TBA
Citation and Details