BDBM563 (3R,3aS,6aR)-hexahydrofuro[2,3-b]furan-3-yl (1S,2R)-1-benzyl-3-[(3S,4aS,8aS)-3-[(tert-butylamino)carbonyl]octahydroisoquinolin-2(1H)-yl]-2-hydroxypropylcarbamate::(3R,3aS,6aR)-hexahydrofuro[2,3-b]furan-3-yl N-[(2S,3R)-4-[(3S,4aS,8aS)-3-(tert-butylcarbamoyl)-decahydroisoquinolin-2-yl]-3-hydroxy-1-phenylbutan-2-yl]carbamate::CHEMBL315403::Isoquinoline furanyl urethane analog. 3::urethane analog 2
SMILES: CC(C)(C)NC(=O)[C@@H]1C[C@@H]2CCCC[C@@H]2CN1C[C@@H](O)[C@H](Cc1ccccc1)NC(=O)O[C@H]1CO[C@H]2OCC[C@@H]12
InChI Key: InChIKey=LQBLSQUSWJJCSP-UZIBIQIJSA-N
Data: 1 KI  3 IC50
Activity Spreadsheet -- Enzyme Inhibition Constant Data from BindingDB
Found 4 hits for monomerid = 563
Trg + Lig
Ki
nM
ΔG°
kcal/mole
IC50
nM
Kd
nM
EC50/IC50
nM
koff
s-1
kon
M-1s-1
pHTemp
°C
HIV-1 Protease
(Human immunodeficiency virus type 1)
BDBM563
((3R,3aS,6aR)-hexahydrofuro[2,3-b]furan-3-yl (1S,2R...)
Show SMILES CC(C)(C)NC(=O)[C@@H]1C[C@@H]2CCCC[C@@H]2CN1C[C@@H](O)[C@H](Cc1ccccc1)NC(=O)O[C@H]1CO[C@H]2OCC[C@@H]12 |r|
Show InChI InChI=1S/C31H47N3O6/c1-31(2,3)33-28(36)25-16-21-11-7-8-12-22(21)17-34(25)18-26(35)24(15-20-9-5-4-6-10-20)32-30(37)40-27-19-39-29-23(27)13-14-38-29/h4-6,9-10,21-27,29,35H,7-8,11-19H2,1-3H3,(H,32,37)(H,33,36)/t21-,22+,23-,24-,25-,26+,27-,29+/m0/s1
2 -11.9n/an/an/an/an/a6.425
University of Illinois at Chicago
Assay Description
The Ki values were determined using fluorogenic substrate, 2-(aminobenzoyl)-Thr-Ile-Nle-Phe(p-NO2)-Gln-ArgNH2. A standard curve relating changes in f...
Bioorg Med Chem Lett 12: 1993-6 (2002)
Article DOI: 10.1016/s0960-894x(02)00300-1
BindingDB Entry DOI: 10.7270/Q2SJ1HS5
Human immunodeficiency virus type 1 protease
(Human immunodeficiency virus type 1)
BDBM563
((3R,3aS,6aR)-hexahydrofuro[2,3-b]furan-3-yl (1S,2R...)
Show SMILES CC(C)(C)NC(=O)[C@@H]1C[C@@H]2CCCC[C@@H]2CN1C[C@@H](O)[C@H](Cc1ccccc1)NC(=O)O[C@H]1CO[C@H]2OCC[C@@H]12 |r|
Show InChI InChI=1S/C31H47N3O6/c1-31(2,3)33-28(36)25-16-21-11-7-8-12-22(21)17-34(25)18-26(35)24(15-20-9-5-4-6-10-20)32-30(37)40-27-19-39-29-23(27)13-14-38-29/h4-6,9-10,21-27,29,35H,7-8,11-19H2,1-3H3,(H,32,37)(H,33,36)/t21-,22+,23-,24-,25-,26+,27-,29+/m0/s1
n/an/a 132n/an/an/an/an/an/a
Merck Research Laboratories
Curated by ChEMBL
Assay Description
Tested for inhibitory activity against HIV protease enzyme
J Med Chem 37: 2506-8 (1994)
BindingDB Entry DOI: 10.7270/Q2WQ02VZ
Human immunodeficiency virus type 1 protease
(Human immunodeficiency virus type 1)
BDBM563
((3R,3aS,6aR)-hexahydrofuro[2,3-b]furan-3-yl (1S,2R...)
Show SMILES CC(C)(C)NC(=O)[C@@H]1C[C@@H]2CCCC[C@@H]2CN1C[C@@H](O)[C@H](Cc1ccccc1)NC(=O)O[C@H]1CO[C@H]2OCC[C@@H]12 |r|
Show InChI InChI=1S/C31H47N3O6/c1-31(2,3)33-28(36)25-16-21-11-7-8-12-22(21)17-34(25)18-26(35)24(15-20-9-5-4-6-10-20)32-30(37)40-27-19-39-29-23(27)13-14-38-29/h4-6,9-10,21-27,29,35H,7-8,11-19H2,1-3H3,(H,32,37)(H,33,36)/t21-,22+,23-,24-,25-,26+,27-,29+/m0/s1
n/an/a 132n/an/an/an/an/an/a
Merck Research Laboratories
Curated by ChEMBL
Assay Description
Tested for inhibitory activity against HIV protease enzyme
J Med Chem 37: 2506-8 (1994)
BindingDB Entry DOI: 10.7270/Q2WQ02VZ
HIV-1 Protease
(Human immunodeficiency virus type 1)
BDBM563
((3R,3aS,6aR)-hexahydrofuro[2,3-b]furan-3-yl (1S,2R...)
Show SMILES CC(C)(C)NC(=O)[C@@H]1C[C@@H]2CCCC[C@@H]2CN1C[C@@H](O)[C@H](Cc1ccccc1)NC(=O)O[C@H]1CO[C@H]2OCC[C@@H]12 |r|
Show InChI InChI=1S/C31H47N3O6/c1-31(2,3)33-28(36)25-16-21-11-7-8-12-22(21)17-34(25)18-26(35)24(15-20-9-5-4-6-10-20)32-30(37)40-27-19-39-29-23(27)13-14-38-29/h4-6,9-10,21-27,29,35H,7-8,11-19H2,1-3H3,(H,32,37)(H,33,36)/t21-,22+,23-,24-,25-,26+,27-,29+/m0/s1
n/an/a 1.80n/an/an/an/a5.530
University of Illinois at Chicago
Assay Description
The IC50 values for the compounds were determined using purified HIV-1 Protease. Inhibition of the cleavage of the peptide H-Val-Ser-Gln-Asn-(L-beta-...
J Med Chem 39: 3278-90 (1996)
Article DOI: 10.1021/jm960128k
BindingDB Entry DOI: 10.7270/Q2CZ35CT