null
SMILES: NC1(Cc2ccc(cc2)C#Cc2ccc(cc2)C(CO)Cc2nc[nH]c(=O)c2O)CCOCC1
InChI Key:
Activity Spreadsheet -- Enzyme Inhibition Constant Data from BindingDB
Found 1 hit for monomerid = 563254
Trg + Lig
Ki
nM
ΔG°
kcal/mole
IC50
nM
Kd
nM
EC50/IC50
nM
koff
s-1
kon
M-1s-1
pHTemp
°C
UDP-3-O-acyl-N-acetylglucosamine deacetylase
(Escherichia coli)
BDBM563254
(US11407740, Compound 64)
Show SMILES NC1(Cc2ccc(cc2)C#Cc2ccc(cc2)C(CO)Cc2nc[nH]c(=O)c2O)CCOCC1
US Patent
n/an/a 30n/an/an/an/an/an/a
TBA
Assay Description
IC50 values against E. coli LpxC were determined using a Rapid Fire MS assay as previously described J. Med. Chem. 2012, 55, 1662-1670.
Citation and Details
BindingDB Entry DOI: 10.7270/Q2GM8BH2