BDBM5683 2-amino-5-thio-substituted thiazole 31::BMS-387032 analog 15::N-(5-{[(5-tert-butyl-1,3-oxazol-2-yl)methyl]sulfanyl}-1,3-thiazol-2-yl)benzamide::N-[5-[[[5-tert-Butyl-2-oxazolyl]methyl]thio]-2-thiazolyl]benzamide
SMILES: CC(C)(C)c1cnc(CSc2cnc(NC(=O)c3ccccc3)s2)o1
InChI Key: InChIKey=CMNKHKYPFIVLLC-UHFFFAOYSA-N
Data: 3 IC50
Activity Spreadsheet -- Enzyme Inhibition Constant Data from BindingDB
Found 3 hits for monomerid = 5683
Trg + Lig
Ki
nM
ΔG°
kcal/mole
IC50
nM
Kd
nM
EC50/IC50
nM
koff
s-1
kon
M-1s-1
pHTemp
°C
CDK2/CycE
(Homo sapiens (Human))
BDBM5683
(2-amino-5-thio-substituted thiazole 31 | BMS-38703...)
Show SMILES CC(C)(C)c1cnc(CSc2cnc(NC(=O)c3ccccc3)s2)o1
Show InChI InChI=1S/C18H19N3O2S2/c1-18(2,3)13-9-19-14(23-13)11-24-15-10-20-17(25-15)21-16(22)12-7-5-4-6-8-12/h4-10H,11H2,1-3H3,(H,20,21,22)
n/an/a 26n/an/an/an/an/an/a
Bristol-Myers Squibb Pharmaceutical Research Institute
Assay Description
The enzyme was assayed with substrate in the presence of 25 uM ATP/[gamma-33P] ATP and test compound. Dose response curves were generated to determ...
J Med Chem 45: 3905-27 (2002)
Article DOI: 10.1021/jm0201520
BindingDB Entry DOI: 10.7270/Q2GT5KC3
CDK2/CycE
(Homo sapiens (Human))
BDBM5683
(2-amino-5-thio-substituted thiazole 31 | BMS-38703...)
Show SMILES CC(C)(C)c1cnc(CSc2cnc(NC(=O)c3ccccc3)s2)o1
Show InChI InChI=1S/C18H19N3O2S2/c1-18(2,3)13-9-19-14(23-13)11-24-15-10-20-17(25-15)21-16(22)12-7-5-4-6-8-12/h4-10H,11H2,1-3H3,(H,20,21,22)
n/an/a 26n/an/an/an/a8.030
Bristol-Myers Squibb Company
Assay Description
The enzyme was assayed with substrate in the presence of 25 uM ATP/[gamma-33P] ATP and test compound. Dose response curves were generated to determ...
J Med Chem 47: 1719-28 (2004)
Article DOI: 10.1021/jm0305568
BindingDB Entry DOI: 10.7270/Q26971SZ
Cyclin-Dependent Kinase 4 (CDK4)
(Homo sapiens (Human))
BDBM5683
(2-amino-5-thio-substituted thiazole 31 | BMS-38703...)
Show SMILES CC(C)(C)c1cnc(CSc2cnc(NC(=O)c3ccccc3)s2)o1
Show InChI InChI=1S/C18H19N3O2S2/c1-18(2,3)13-9-19-14(23-13)11-24-15-10-20-17(25-15)21-16(22)12-7-5-4-6-8-12/h4-10H,11H2,1-3H3,(H,20,21,22)
NCI pathway
Reactome pathway
n/an/a 960n/an/an/an/an/an/a
Bristol-Myers Squibb Pharmaceutical Research Institute
Assay Description
The enzyme was assayed with substrate in the presence of 25 uM ATP/[gamma-33P] ATP and test compound. Dose response curves were generated to determ...
J Med Chem 45: 3905-27 (2002)
Article DOI: 10.1021/jm0201520
BindingDB Entry DOI: 10.7270/Q2GT5KC3