BDBM56852 MLS000050141::N-[4-(1,3-benzoxazol-2-yl)phenyl]-1,3-benzodioxole-5-carboxamide::N-[4-(1,3-benzoxazol-2-yl)phenyl]-piperonylamide::SMR000077237::cid_2212108
SMILES: O=C(Nc1ccc(cc1)-c1nc2ccccc2o1)c1ccc2OCOc2c1
InChI Key: InChIKey=WCTQMHIHVIKMIC-UHFFFAOYSA-N
Data: 1 IC50
Activity Spreadsheet -- Enzyme Inhibition Constant Data from BindingDB
Found 1 hit for monomerid = 56852
Trg + Lig
Ki
nM
ΔG°
kcal/mole
IC50
nM
Kd
nM
EC50/IC50
nM
koff
s-1
kon
M-1s-1
pHTemp
°C
DNA repair protein RAD51 homolog 1
(Homo sapiens (Human))
BDBM56852
(MLS000050141 | N-[4-(1,3-benzoxazol-2-yl)phenyl]-1...)
Show SMILES O=C(Nc1ccc(cc1)-c1nc2ccccc2o1)c1ccc2OCOc2c1
Show InChI InChI=1S/C21H14N2O4/c24-20(14-7-10-18-19(11-14)26-12-25-18)22-15-8-5-13(6-9-15)21-23-16-3-1-2-4-17(16)27-21/h1-11H,12H2,(H,22,24)
Reactome pathway
PCBioAssay
n/an/a 8.50E+4n/an/an/an/an/an/a
PCMD
Curated by PubChem BioAssay
Assay Description
Project Title: A screen for modulators of human Rad51, a key DNA repair protein Application Number: MH084119 Assay Submitter: Dr. Alex Mazin Submitte...
PubChem Bioassay (2008)
BindingDB Entry DOI: 10.7270/Q2BV7F1T