null
SMILES: CCCOC(=O)c1ccc(Oc2c[nH]nc2-c2ccc(OCC)cc2O)cc1
InChI Key: InChIKey=LMVDVLWHGRISHP-UHFFFAOYSA-N
Activity Spreadsheet -- Enzyme Inhibition Constant Data from BindingDB
Found 6 hits for monomerid = 56927
Trg + Lig
Ki
nM
ΔG°
kcal/mole
IC50
nM
Kd
nM
EC50/IC50
nM
koff
s-1
kon
M-1s-1
pHTemp
°C
Streptokinase A
(Streptococcus pyogenes M1 GAS)
BDBM56927
(4-[[(3E)-3-(4-ethoxy-6-keto-cyclohexa-2,4-dien-1-y...)
Show SMILES CCCOC(=O)c1ccc(Oc2c[nH]nc2-c2ccc(OCC)cc2O)cc1
Show InChI InChI=1S/C21H22N2O5/c1-3-11-27-21(25)14-5-7-15(8-6-14)28-19-13-22-23-20(19)17-10-9-16(26-4-2)12-18(17)24/h5-10,12-13,24H,3-4,11H2,1-2H3,(H,22,23)
PCBioAssay
n/an/an/an/a 1.50E+5n/an/an/an/a
Broad Institute
Curated by PubChem BioAssay
Assay Description
Keywords: Group A streptococcus, GAS, streptokinase, expression, virulence, inhibition, dose response, EC50 Assay Overview: The goal of this assa...
PubChem Bioassay (2009)
BindingDB Entry DOI: 10.7270/Q2736PBV
G-protein coupled receptor 55
(Homo sapiens (Human))
BDBM56927
(4-[[(3E)-3-(4-ethoxy-6-keto-cyclohexa-2,4-dien-1-y...)
Show SMILES CCCOC(=O)c1ccc(Oc2c[nH]nc2-c2ccc(OCC)cc2O)cc1
Show InChI InChI=1S/C21H22N2O5/c1-3-11-27-21(25)14-5-7-15(8-6-14)28-19-13-22-23-20(19)17-10-9-16(26-4-2)12-18(17)24/h5-10,12-13,24H,3-4,11H2,1-2H3,(H,22,23)
Reactome pathway
PCBioAssay
n/an/an/an/a 3.20E+4n/an/an/an/a
Burnham Center for Chemical Genomics
Curated by PubChem BioAssay
Assay Description
Data Source: Sanford-Burnham Center for Chemical Genomics (SBCCG) Source Affiliation: Sanford-Burnham Medical Research Institute (SBMRI, San Diego, C...
PubChem Bioassay (2010)
BindingDB Entry DOI: 10.7270/Q2GF0RZ3
Corticotropin-releasing factor-binding protein
(Homo sapiens (Human))
BDBM56927
(4-[[(3E)-3-(4-ethoxy-6-keto-cyclohexa-2,4-dien-1-y...)
Show SMILES CCCOC(=O)c1ccc(Oc2c[nH]nc2-c2ccc(OCC)cc2O)cc1
Show InChI InChI=1S/C21H22N2O5/c1-3-11-27-21(25)14-5-7-15(8-6-14)28-19-13-22-23-20(19)17-10-9-16(26-4-2)12-18(17)24/h5-10,12-13,24H,3-4,11H2,1-2H3,(H,22,23)
PCBioAssay
n/an/an/an/a>5.30E+4n/an/an/an/a
Burnham Center for Chemical Genomics
Curated by PubChem BioAssay
Assay Description
Data Source: Sanford-Burnham Center for Chemical Genomics (SBCCG) Source Affiliation: Sanford-Burnham Medical Research Institute (SBMRI, San Diego, C...
PubChem Bioassay (2012)
BindingDB Entry DOI: 10.7270/Q2VX0F3D
X-box-binding protein 1
(Homo sapiens (Human))
BDBM56927
(4-[[(3E)-3-(4-ethoxy-6-keto-cyclohexa-2,4-dien-1-y...)
Show SMILES CCCOC(=O)c1ccc(Oc2c[nH]nc2-c2ccc(OCC)cc2O)cc1
Show InChI InChI=1S/C21H22N2O5/c1-3-11-27-21(25)14-5-7-15(8-6-14)28-19-13-22-23-20(19)17-10-9-16(26-4-2)12-18(17)24/h5-10,12-13,24H,3-4,11H2,1-2H3,(H,22,23)
PCBioAssay
n/an/a 1.00E+4n/an/an/an/an/an/a
Emory University Molecular Libraries Screening Center
Curated by PubChem BioAssay
Assay Description
NIH Molecular Libraries Screening Centers Network [MLSCN] Emory Chemical Biology Discovery Center in MLSCN Assay provider: Dr. Randal Kaufman, Univer...
PubChem Bioassay (2011)
BindingDB Entry DOI: 10.7270/Q2NK3CGB
DNA damage-inducible transcript 3 protein
(Mus musculus)
BDBM56927
(4-[[(3E)-3-(4-ethoxy-6-keto-cyclohexa-2,4-dien-1-y...)
Show SMILES CCCOC(=O)c1ccc(Oc2c[nH]nc2-c2ccc(OCC)cc2O)cc1
Show InChI InChI=1S/C21H22N2O5/c1-3-11-27-21(25)14-5-7-15(8-6-14)28-19-13-22-23-20(19)17-10-9-16(26-4-2)12-18(17)24/h5-10,12-13,24H,3-4,11H2,1-2H3,(H,22,23)
PCBioAssay
n/an/a>1.00E+4n/an/an/an/an/an/a
Emory University Molecular Libraries Screening Center
Curated by PubChem BioAssay
Assay Description
NIH Molecular Libraries Screening Centers Network [MLSCN] Emory Chemical Biology Discovery Center in MLSCN Assay provider: Dr. Randal Kaufman, Univer...
PubChem Bioassay (2011)
BindingDB Entry DOI: 10.7270/Q28C9TQN
DNA damage-inducible transcript 3 protein
(Mus musculus)
BDBM56927
(4-[[(3E)-3-(4-ethoxy-6-keto-cyclohexa-2,4-dien-1-y...)
Show SMILES CCCOC(=O)c1ccc(Oc2c[nH]nc2-c2ccc(OCC)cc2O)cc1
Show InChI InChI=1S/C21H22N2O5/c1-3-11-27-21(25)14-5-7-15(8-6-14)28-19-13-22-23-20(19)17-10-9-16(26-4-2)12-18(17)24/h5-10,12-13,24H,3-4,11H2,1-2H3,(H,22,23)
PCBioAssay
n/an/a>1.00E+4n/an/an/an/an/an/a
Emory University Molecular Libraries Screening Center
Curated by PubChem BioAssay
Assay Description
NIH Molecular Libraries Screening Centers Network [MLSCN] Emory Chemical Biology Discovery Center in MLSCN Assay provider: Dr. Randal Kaufman, Univer...
PubChem Bioassay (2010)
BindingDB Entry DOI: 10.7270/Q2PC30VZ