null
SMILES: CCCCc1cncc2ccc(NC(=O)[C@@H]3CC3c3ccc(cc3)S(=O)(=O)Nc3ccccn3)cc12
InChI Key:
Activity Spreadsheet -- Enzyme Inhibition Constant Data from BindingDB
Found 7 hits for monomerid = 569295
Trg + Lig
Ki
nM
ΔG°
kcal/mole
IC50
nM
Kd
nM
EC50/IC50
nM
koff
s-1
kon
M-1s-1
pHTemp
°C
Inhibitor of nuclear factor kappa-B kinase subunit beta
(Homo sapiens (Human))
BDBM569295
(US11427563, Compound 49)
Show SMILES CCCCc1cncc2ccc(NC(=O)[C@@H]3CC3c3ccc(cc3)S(=O)(=O)Nc3ccccn3)cc12 |r|
NCI pathway
Reactome pathway
US Patent
n/an/a 0.200n/an/an/an/an/an/a
TBA
Assay Description
All compounds were initially prepared as 10 mM stocks in anhydrous dimethylsulfoxide (DMSO). A 20 μl aliquot of the 10 mM solutions was transfer...
Citation and Details
BindingDB Entry DOI: 10.7270/Q2DJ5JVK
Tyrosine-protein kinase JAK1
(Homo sapiens (Human))
BDBM569295
(US11427563, Compound 49)
Show SMILES CCCCc1cncc2ccc(NC(=O)[C@@H]3CC3c3ccc(cc3)S(=O)(=O)Nc3ccccn3)cc12 |r|
Reactome pathway
US Patent
n/an/a 48n/an/an/an/an/an/a
TBA
Assay Description
Compounds were prepared in the exact same manner as described in the ROCK Kinase Assay with the exception to the substrate and enzyme. The JAK 2× sub...
Citation and Details
BindingDB Entry DOI: 10.7270/Q2DJ5JVK
Tyrosine-protein kinase JAK3
(Homo sapiens (Human))
BDBM569295
(US11427563, Compound 49)
Show SMILES CCCCc1cncc2ccc(NC(=O)[C@@H]3CC3c3ccc(cc3)S(=O)(=O)Nc3ccccn3)cc12 |r|
Reactome pathway
US Patent
n/an/a 16n/an/an/an/an/an/a
TBA
Assay Description
Compounds were prepared in the exact same manner as described in the ROCK Kinase Assay with the exception to the substrate and enzyme. The JAK 2× sub...
Citation and Details
BindingDB Entry DOI: 10.7270/Q2DJ5JVK
Non-receptor tyrosine-protein kinase TYK2
(Homo sapiens (Human))
BDBM569295
(US11427563, Compound 49)
Show SMILES CCCCc1cncc2ccc(NC(=O)[C@@H]3CC3c3ccc(cc3)S(=O)(=O)Nc3ccccn3)cc12 |r|
US Patent
n/an/a 91n/an/an/an/an/an/a
TBA
Assay Description
Compounds were prepared in the exact same manner as described in the ROCK Kinase Assay with the exception to the substrate and enzyme. The JAK 2× sub...
Citation and Details
BindingDB Entry DOI: 10.7270/Q2DJ5JVK
Tyrosine-protein kinase JAK2
(Homo sapiens (Human))
BDBM569295
(US11427563, Compound 49)
Show SMILES CCCCc1cncc2ccc(NC(=O)[C@@H]3CC3c3ccc(cc3)S(=O)(=O)Nc3ccccn3)cc12 |r|
Reactome pathway
US Patent
n/an/a 2n/an/an/an/an/an/a
TBA
Assay Description
Compounds were prepared in the exact same manner as described in the ROCK Kinase Assay with the exception to the substrate and enzyme. The JAK 2× sub...
Citation and Details
BindingDB Entry DOI: 10.7270/Q2DJ5JVK
Rho-associated protein kinase 2
(Homo sapiens (Human))
BDBM569295
(US11427563, Compound 49)
Show SMILES CCCCc1cncc2ccc(NC(=O)[C@@H]3CC3c3ccc(cc3)S(=O)(=O)Nc3ccccn3)cc12 |r|
US Patent
n/an/a 181n/an/an/an/an/an/a
TBA
Assay Description
All compounds were initially prepared as 10 mM stocks in anhydrous dimethylsulfoxide (DMSO). A 20 μl aliquot of the 10 mM solutions was transfer...
Citation and Details
BindingDB Entry DOI: 10.7270/Q2DJ5JVK
Rho-associated protein kinase 1
(Homo sapiens (Human))
BDBM569295
(US11427563, Compound 49)
Show SMILES CCCCc1cncc2ccc(NC(=O)[C@@H]3CC3c3ccc(cc3)S(=O)(=O)Nc3ccccn3)cc12 |r|
NCI pathway
Reactome pathway
US Patent
n/an/a 207n/an/an/an/an/an/a
TBA
Assay Description
All compounds were initially prepared as 10 mM stocks in anhydrous dimethylsulfoxide (DMSO). A 20 μl aliquot of the 10 mM solutions was transfer...
Citation and Details
BindingDB Entry DOI: 10.7270/Q2DJ5JVK