null
SMILES: CC(C)(C)Nc1nc(nc2cnccc12)-c1ccnc(N)c1
InChI Key:
Activity Spreadsheet -- Enzyme Inhibition Constant Data from BindingDB
Found 1 hit for monomerid = 574283
Trg + Lig
Ki
nM
ΔG°
kcal/mole
IC50
nM
Kd
nM
EC50/IC50
nM
koff
s-1
kon
M-1s-1
pHTemp
°C
Serine/threonine-protein kinase LATS1
(Homo sapiens (Human))
BDBM574283
(US11458138, Example 112)
Show SMILES CC(C)(C)Nc1nc(nc2cnccc12)-c1ccnc(N)c1
Reactome pathway
n/an/a 2n/an/an/an/an/an/a
TBA
Citation and Details