BDBM58055 2-[[2-(3,5-dimethyl-1-pyrazolyl)-5,6,7,8-tetrahydro-[1]benzothiolo[2,3-d]pyrimidin-4-yl]thio]acetic acid::2-[[2-(3,5-dimethylpyrazol-1-yl)-5,6,7,8-tetrahydro-[1]benzothiolo[2,3-d]pyrimidin-4-yl]sulfanyl]acetic acid::2-[[2-(3,5-dimethylpyrazol-1-yl)-5,6,7,8-tetrahydro-[1]benzothiolo[2,3-d]pyrimidin-4-yl]sulfanyl]ethanoic acid::2-[[2-(3,5-dimethylpyrazol-1-yl)-5,6,7,8-tetrahydrobenzothiopheno[2,3-d]pyrimidin-4-yl]thio]acetic acid::MLS000778763::SMR000415539::[2-(3,5-Dimethyl-pyrazol-1-yl)-5,6,7,8-tetrahydro-benzo[4,5]thieno[2,3-d]pyrimidin-4-ylsulfanyl]-acetic acid::cid_4268779
SMILES: Cc1cc(C)n(n1)-c1nc(SCC(O)=O)c2c3CCCCc3sc2n1
InChI Key: InChIKey=LWZDWWHTSPBFFN-UHFFFAOYSA-N
Data: 1 EC50
Activity Spreadsheet -- Enzyme Inhibition Constant Data from BindingDB
Found 1 hit for monomerid = 58055
Trg + Lig
Ki
nM
ΔG°
kcal/mole
IC50
nM
Kd
nM
EC50/IC50
nM
koff
s-1
kon
M-1s-1
pHTemp
°C
streptokinase A precursor
(Streptococcus pyogenes M1 GAS)
BDBM58055
(2-[[2-(3,5-dimethyl-1-pyrazolyl)-5,6,7,8-tetrahydr...)
Show SMILES Cc1cc(C)n(n1)-c1nc(SCC(O)=O)c2c3CCCCc3sc2n1
Show InChI InChI=1S/C17H18N4O2S2/c1-9-7-10(2)21(20-9)17-18-15(24-8-13(22)23)14-11-5-3-4-6-12(11)25-16(14)19-17/h7H,3-6,8H2,1-2H3,(H,22,23)
PCBioAssay
n/an/an/an/a 1.50E+5n/an/an/an/a
Broad Institute
Curated by PubChem BioAssay
Assay Description
Keywords: Group A streptococcus, GAS, streptokinase, expression, virulence, inhibition, dose response, EC50 Assay Overview: The goal of this assa...
PubChem Bioassay (2009)
BindingDB Entry DOI: 10.7270/Q2736PBV