null
SMILES:
InChI Key: InChIKey=KYLITGQQDLYBCT-UHFFFAOYSA-N
Activity Spreadsheet -- Enzyme Inhibition Constant Data from BindingDB
Found 3 hits for monomerid = 58071
Trg + Lig
Ki
nM
ΔG°
kcal/mole
IC50
nM
Kd
nM
EC50/IC50
nM
koff
s-1
kon
M-1s-1
pHTemp
°C
Streptokinase A
(Streptococcus pyogenes M1 GAS)
BDBM58071
(1-Adamantan-2-yl-3-hexanoyl-thiourea | MLS00076243...)
Show InChI InChI=1S/C17H28N2OS/c1-2-3-4-5-15(20)18-17(21)19-16-13-7-11-6-12(9-13)10-14(16)8-11/h11-14,16H,2-10H2,1H3,(H2,18,19,20,21)
PCBioAssay
n/an/an/an/a 1.15E+4n/an/an/an/a
Broad Institute
Curated by PubChem BioAssay
Assay Description
Keywords: Group A streptococcus, GAS, streptokinase, expression, virulence, inhibition, dose response, EC50 Assay Overview: The goal of this assa...
PubChem Bioassay (2009)
BindingDB Entry DOI: 10.7270/Q2736PBV
Albumin
(Bos taurus)
BDBM58071
(1-Adamantan-2-yl-3-hexanoyl-thiourea | MLS00076243...)
Show InChI InChI=1S/C17H28N2OS/c1-2-3-4-5-15(20)18-17(21)19-16-13-7-11-6-12(9-13)10-14(16)8-11/h11-14,16H,2-10H2,1H3,(H2,18,19,20,21)
Reactome pathway
PCBioAssay
n/an/a>9.41E+4n/an/an/an/an/an/a
The Scripps Research Institute Molecular Screening Center
Curated by PubChem BioAssay
PubChem Bioassay (2013)
BindingDB Entry DOI: 10.7270/Q2RX99Q9
T cell receptor alpha variable 4
(Homo sapiens (Human))
BDBM58071
(1-Adamantan-2-yl-3-hexanoyl-thiourea | MLS00076243...)
Show InChI InChI=1S/C17H28N2OS/c1-2-3-4-5-15(20)18-17(21)19-16-13-7-11-6-12(9-13)10-14(16)8-11/h11-14,16H,2-10H2,1H3,(H2,18,19,20,21)
PCBioAssay
n/an/a>9.41E+4n/an/an/an/an/an/a
The Scripps Research Institute Molecular Screening Center
Curated by PubChem BioAssay
PubChem Bioassay (2013)
BindingDB Entry DOI: 10.7270/Q2WQ02FK