BDBM58075 (2-Methyl-3-phenyl-5-propyl-pyrazolo[1,5-a]pyrimidin-7-yl)-pyridin-2-ylmethyl-amine::(2-methyl-3-phenyl-5-propyl-pyrazolo[1,5-a]pyrimidin-7-yl)-(2-pyridylmethyl)amine::2-methyl-3-phenyl-5-propyl-N-(2-pyridinylmethyl)-7-pyrazolo[1,5-a]pyrimidinamine::2-methyl-3-phenyl-5-propyl-N-(pyridin-2-ylmethyl)pyrazolo[1,5-a]pyrimidin-7-amine::MLS000762884::SMR000439712::cid_1861043
SMILES: CCCc1cc(NCc2ccccn2)n2nc(C)c(-c3ccccc3)c2n1
InChI Key: InChIKey=UVWOTTZGIWDSDI-UHFFFAOYSA-N
Data: 2 EC50
Activity Spreadsheet -- Enzyme Inhibition Constant Data from BindingDB
Found 2 hits for monomerid = 58075
Trg + Lig
Ki
nM
ΔG°
kcal/mole
IC50
nM
Kd
nM
EC50/IC50
nM
koff
s-1
kon
M-1s-1
pHTemp
°C
Glycogen synthase kinase-3 beta
(Homo sapiens (Human))
BDBM58075
((2-Methyl-3-phenyl-5-propyl-pyrazolo[1,5-a]pyrimid...)
Show SMILES CCCc1cc(NCc2ccccn2)n2nc(C)c(-c3ccccc3)c2n1
Show InChI InChI=1S/C22H23N5/c1-3-9-18-14-20(24-15-19-12-7-8-13-23-19)27-22(25-18)21(16(2)26-27)17-10-5-4-6-11-17/h4-8,10-14,24H,3,9,15H2,1-2H3
NCI pathway
Reactome pathway
PCBioAssay
n/an/an/an/a>3.00E+5n/an/an/an/a
Broad Institute
Curated by PubChem BioAssay
Assay Description
Keywords: GSK3beta, dose response, kinase, inhibition, HTS Assay Overview: The glycogen synthase kinase-3 beta (GSK-3b) is a known master regulator f...
PubChem Bioassay (2010)
BindingDB Entry DOI: 10.7270/Q2TX3CTT
streptokinase A precursor
(Streptococcus pyogenes M1 GAS)
BDBM58075
((2-Methyl-3-phenyl-5-propyl-pyrazolo[1,5-a]pyrimid...)
Show SMILES CCCc1cc(NCc2ccccn2)n2nc(C)c(-c3ccccc3)c2n1
Show InChI InChI=1S/C22H23N5/c1-3-9-18-14-20(24-15-19-12-7-8-13-23-19)27-22(25-18)21(16(2)26-27)17-10-5-4-6-11-17/h4-8,10-14,24H,3,9,15H2,1-2H3
PCBioAssay
n/an/an/an/a 1.50E+5n/an/an/an/a
Broad Institute
Curated by PubChem BioAssay
Assay Description
Keywords: Group A streptococcus, GAS, streptokinase, expression, virulence, inhibition, dose response, EC50 Assay Overview: The goal of this assa...
PubChem Bioassay (2009)
BindingDB Entry DOI: 10.7270/Q2736PBV