null
SMILES: C(Sc1nc2ccccc2s1)Sc1nc2ccccc2s1
InChI Key: InChIKey=MXPRFFFCRFBOPX-UHFFFAOYSA-N
Activity Spreadsheet -- Enzyme Inhibition Constant Data from BindingDB
Found 1 hit for monomerid = 58095
Trg + Lig
Ki
nM
ΔG°
kcal/mole
IC50
nM
Kd
nM
EC50/IC50
nM
koff
s-1
kon
M-1s-1
pHTemp
°C
Streptokinase A
(Streptococcus pyogenes M1 GAS)
BDBM58095
(2-(1,3-benzothiazol-2-ylsulfanylmethylsulfanyl)-1,...)
Show SMILES C(Sc1nc2ccccc2s1)Sc1nc2ccccc2s1
Show InChI InChI=1S/C15H10N2S4/c1-3-7-12-10(5-1)16-14(20-12)18-9-19-15-17-11-6-2-4-8-13(11)21-15/h1-8H,9H2
PCBioAssay
n/an/an/an/a 1.50E+5n/an/an/an/a
Broad Institute
Curated by PubChem BioAssay
Assay Description
Keywords: Group A streptococcus, GAS, streptokinase, expression, virulence, inhibition, dose response, EC50 Assay Overview: The goal of this assa...
PubChem Bioassay (2009)
BindingDB Entry DOI: 10.7270/Q2736PBV