BDBM59144 Hymenialdisine, 28ac
SMILES: Fc1ccc2[nH]c3c(C(CCNC3=O)=NNc3ccc(Cl)cn3)c2c1
InChI Key: InChIKey=JFEXQCAPNBAVHH-UHFFFAOYSA-N
Data: 2 IC50
Activity Spreadsheet -- Enzyme Inhibition Constant Data from BindingDB
Found 2 hits for monomerid = 59144
Trg + Lig
Ki
nM
ΔG°
kcal/mole
IC50
nM
Kd
nM
EC50/IC50
nM
koff
s-1
kon
M-1s-1
pHTemp
°C
Glycogen synthase kinase-3 beta
(Homo sapiens (Human))
BDBM59144
(Hymenialdisine, 28ac)
Show SMILES Fc1ccc2[nH]c3c(C(CCNC3=O)=NNc3ccc(Cl)cn3)c2c1 |w:14.15|
Show InChI InChI=1S/C17H13ClFN5O/c18-9-1-4-14(21-8-9)24-23-13-5-6-20-17(25)16-15(13)11-7-10(19)2-3-12(11)22-16/h1-4,7-8,22H,5-6H2,(H,20,25)(H,21,24)
NCI pathway
Reactome pathway
n/an/a 613n/an/an/an/a7.2n/a
Genomics Institute of the Novartis Research Foundation
Assay Description
In vitro kinase assay using SPA assay kit from Amersham Pharmacia Biotech, Uk.
Chem Biol 11: 247-59 (2004)
Article DOI: 10.1016/j.chembiol.2004.01.015
BindingDB Entry DOI: 10.7270/Q2FN14M9
Cyclin-dependent kinase 5 regulatory subunit 1
(Homo sapiens (Human))
BDBM59144
(Hymenialdisine, 28ac)
Show SMILES Fc1ccc2[nH]c3c(C(CCNC3=O)=NNc3ccc(Cl)cn3)c2c1 |w:14.15|
Show InChI InChI=1S/C17H13ClFN5O/c18-9-1-4-14(21-8-9)24-23-13-5-6-20-17(25)16-15(13)11-7-10(19)2-3-12(11)22-16/h1-4,7-8,22H,5-6H2,(H,20,25)(H,21,24)
NCI pathway
Reactome pathway
n/an/a 75n/an/an/an/a7.2n/a
Genomics Institute of the Novartis Research Foundation
Assay Description
In vitro kinase assay using SPA assay kit from Amersham Pharmacia Biotech, Uk.
Chem Biol 11: 247-59 (2004)
Article DOI: 10.1016/j.chembiol.2004.01.015
BindingDB Entry DOI: 10.7270/Q2FN14M9