BDBM59222 Pepstatin analog, 10
SMILES: CC(C)C[C@@H](NC(=O)[C@H](NC(=O)CCCCCCCCCCCCCCC(=O)N[C@H](CC(N)=O)C(=O)N[C@@H](Cc1ccccc1)C(O)=O)C(C)O)C(=O)NCCc1ccc(N)cc1
InChI Key: InChIKey=WDNSCOBNNSIZKN-KUMZHBIPSA-N
Data: 1 KI  1 IC50
Activity Spreadsheet -- Enzyme Inhibition Constant Data from BindingDB
Found 1 hit for monomerid = 59222
Trg + Lig
Ki
nM
ΔG°
kcal/mole
IC50
nM
Kd
nM
EC50/IC50
nM
koff
s-1
kon
M-1s-1
pHTemp
°C
Human herpesvirus 1 protease
(Human herpesvirus 1 (strain 17) (HHV-1) (Human her...)
BDBM59222
(Pepstatin analog, 10)
Show SMILES CC(C)C[C@@H](NC(=O)[C@H](NC(=O)CCCCCCCCCCCCCCC(=O)N[C@H](CC(N)=O)C(=O)N[C@@H](Cc1ccccc1)C(O)=O)C(C)O)C(=O)NCCc1ccc(N)cc1 |r|
Show InChI InChI=1S/C47H73N7O9/c1-32(2)29-37(44(59)50-28-27-34-23-25-36(48)26-24-34)52-46(61)43(33(3)55)54-42(58)22-18-13-11-9-7-5-4-6-8-10-12-17-21-41(57)51-38(31-40(49)56)45(60)53-39(47(62)63)30-35-19-15-14-16-20-35/h14-16,19-20,23-26,32-33,37-39,43,55H,4-13,17-18,21-22,27-31,48H2,1-3H3,(H2,49,56)(H,50,59)(H,51,57)(H,52,61)(H,53,60)(H,54,58)(H,62,63)/t33?,37-,38-,39+,43-/m1/s1
650n/a 2.50E+3n/an/an/an/a5.52n/a
Purdue University
Assay Description
A zhang-poorman assay confirms a competitive inhibition mechanism or inhibit HIV-1 PR as a dimerization or mixed type inhibitor.
Chem Biol 12: 439-44 (2005)
Article DOI: 10.1016/j.chembiol.2005.02.004
BindingDB Entry DOI: 10.7270/Q2JD4V68