BDBM5930 BMS-387032 analog 20::N-(5-{[(5-tert-butyl-1,3-oxazol-2-yl)methyl]sulfanyl}-1,3-thiazol-2-yl)-2-(piperidin-4-yl)acetamide::N-[5-[[[5-(1,1-Dimethylethyl)-2-oxazolyl]methyl]thio]-2-thiazolyl]-4-methylpiperidinecarboxamide
SMILES: CC(C)(C)c1cnc(CSc2cnc(NC(=O)CC3CCNCC3)s2)o1
InChI Key: InChIKey=RWUQSPFTCQLAQX-UHFFFAOYSA-N
Data: 1 IC50
Activity Spreadsheet -- Enzyme Inhibition Constant Data from BindingDB
Found 1 hit for monomerid = 5930
Trg + Lig
Ki
nM
ΔG°
kcal/mole
IC50
nM
Kd
nM
EC50/IC50
nM
koff
s-1
kon
M-1s-1
pHTemp
°C
CDK2/CycE
(Homo sapiens (Human))
BDBM5930
(BMS-387032 analog 20 | N-(5-{[(5-tert-butyl-1,3-ox...)
Show SMILES CC(C)(C)c1cnc(CSc2cnc(NC(=O)CC3CCNCC3)s2)o1
Show InChI InChI=1S/C18H26N4O2S2/c1-18(2,3)13-9-20-15(24-13)11-25-16-10-21-17(26-16)22-14(23)8-12-4-6-19-7-5-12/h9-10,12,19H,4-8,11H2,1-3H3,(H,21,22,23)
n/an/a 11n/an/an/an/a8.030
Bristol-Myers Squibb Company
Assay Description
The enzyme was assayed with substrate in the presence of 25 uM ATP/[gamma-33P] ATP and test compound. Dose response curves were generated to determ...
J Med Chem 47: 1719-28 (2004)
Article DOI: 10.1021/jm0305568
BindingDB Entry DOI: 10.7270/Q26971SZ