BDBM5936 4-amino-N-(5-{[(5-tert-butyl-1,3-oxazol-2-yl)methyl]sulfanyl}-1,3-thiazol-2-yl)cyclohexane-1-carboxamide::BMS-387032 analog 26::cis-4-Amino-N-[5-[[[5-(1,1-dimethylethyl)-2-oxazolyl]methyl]thio]-2-thiazolyl]cyclohexanecarboxamide Hydrochloride
SMILES: CC(C)(C)c1cnc(CSc2cnc(NC(=O)[C@@H]3CC[C@H](N)CC3)s2)o1
InChI Key: InChIKey=MFPWMKHFMBARRG-TXEJJXNPSA-N
Data: 1 IC50
Activity Spreadsheet -- Enzyme Inhibition Constant Data from BindingDB
Found 1 hit for monomerid = 5936
Trg + Lig
Ki
nM
ΔG°
kcal/mole
IC50
nM
Kd
nM
EC50/IC50
nM
koff
s-1
kon
M-1s-1
pHTemp
°C
CDK2/CycE
(Homo sapiens (Human))
BDBM5936
(4-amino-N-(5-{[(5-tert-butyl-1,3-oxazol-2-yl)methy...)
Show SMILES CC(C)(C)c1cnc(CSc2cnc(NC(=O)[C@@H]3CC[C@H](N)CC3)s2)o1 |r,wU:17.16,20.20,(-8.93,3.23,;-7.79,4.26,;-8.11,5.77,;-9.25,4.74,;-6.32,3.79,;-5.85,2.32,;-4.3,2.32,;-3.83,3.79,;-2.36,4.26,;-1.22,3.23,;.24,3.71,;.72,5.17,;2.26,5.17,;2.74,3.71,;4.2,3.23,;5.53,4,;5.53,5.54,;6.87,3.23,;6.87,1.69,;8.2,.92,;9.54,1.69,;10.87,.92,;9.54,3.23,;8.2,4,;1.49,2.8,;-5.07,4.69,)|
Show InChI InChI=1S/C18H26N4O2S2/c1-18(2,3)13-8-20-14(24-13)10-25-15-9-21-17(26-15)22-16(23)11-4-6-12(19)7-5-11/h8-9,11-12H,4-7,10,19H2,1-3H3,(H,21,22,23)/t11-,12+
n/an/a 22n/an/an/an/a8.030
Bristol-Myers Squibb Company
Assay Description
The enzyme was assayed with substrate in the presence of 25 uM ATP/[gamma-33P] ATP and test compound. Dose response curves were generated to determ...
J Med Chem 47: 1719-28 (2004)
Article DOI: 10.1021/jm0305568
BindingDB Entry DOI: 10.7270/Q26971SZ