null
SMILES: CCn1c2ccccc2c2cc(NC(=O)CSc3nccc(=O)[nH]3)ccc12
InChI Key: InChIKey=ALEUTTNIZDFZSP-UHFFFAOYSA-N
Activity Spreadsheet -- Enzyme Inhibition Constant Data from BindingDB
Found 3 hits for monomerid = 60201
Trg + Lig
Ki
nM
ΔG°
kcal/mole
IC50
nM
Kd
nM
EC50/IC50
nM
koff
s-1
kon
M-1s-1
pHTemp
°C
M17 leucyl aminopeptidase
(Plasmodium falciparum 3D7)
BDBM60201
(MLS000775166 | N-(9-ethyl-3-carbazolyl)-2-[(6-oxo-...)
Show SMILES CCn1c2ccccc2c2cc(NC(=O)CSc3nccc(=O)[nH]3)ccc12
Show InChI InChI=1S/C20H18N4O2S/c1-2-24-16-6-4-3-5-14(16)15-11-13(7-8-17(15)24)22-19(26)12-27-20-21-10-9-18(25)23-20/h3-11H,2,12H2,1H3,(H,22,26)(H,21,23,25)
PCBioAssay
n/an/a 1.41E+3n/an/an/an/an/an/a
SRMLSC
Curated by PubChem BioAssay
Assay Description
Southern Research Molecular Libraries Screening Center (SRMLSC) Southern Research Institute (Birmingham, Alabama) NIH Molecular Libraries Screening...
PubChem Bioassay (2009)
BindingDB Entry DOI: 10.7270/Q27W69N8
Probable nicotinate-nucleotide adenylyltransferase
(Staphylococcus aureus subsp. aureus N315)
BDBM60201
(MLS000775166 | N-(9-ethyl-3-carbazolyl)-2-[(6-oxo-...)
Show SMILES CCn1c2ccccc2c2cc(NC(=O)CSc3nccc(=O)[nH]3)ccc12
Show InChI InChI=1S/C20H18N4O2S/c1-2-24-16-6-4-3-5-14(16)15-11-13(7-8-17(15)24)22-19(26)12-27-20-21-10-9-18(25)23-20/h3-11H,2,12H2,1H3,(H,22,26)(H,21,23,25)
PCBioAssay
n/an/a 4.24E+4n/an/an/an/an/an/a
Burnham Center for Chemical Genomics
Curated by PubChem BioAssay
PubChem Bioassay (2012)
BindingDB Entry DOI: 10.7270/Q2BV7F7H
Procathepsin L
(Homo sapiens (Human))
BDBM60201
(MLS000775166 | N-(9-ethyl-3-carbazolyl)-2-[(6-oxo-...)
Show SMILES CCn1c2ccccc2c2cc(NC(=O)CSc3nccc(=O)[nH]3)ccc12
Show InChI InChI=1S/C20H18N4O2S/c1-2-24-16-6-4-3-5-14(16)15-11-13(7-8-17(15)24)22-19(26)12-27-20-21-10-9-18(25)23-20/h3-11H,2,12H2,1H3,(H,22,26)(H,21,23,25)
Reactome pathway
PCBioAssay
n/an/a>5.96E+4n/an/an/an/an/an/a
The Scripps Research Institute Molecular Screening Center
Curated by PubChem BioAssay
Assay Description
Source (MLPCN Center Name): The Scripps Research Institute Molecular Screening Center Affiliation: The Scripps Research Institute, TSRI Assay Provide...
PubChem Bioassay (2009)
BindingDB Entry DOI: 10.7270/Q2NZ8631