null
SMILES: Brc1ccccc1C(=O)Sc1cccc2cccnc12
InChI Key: InChIKey=SVAGCAFOMRRHDH-UHFFFAOYSA-N
Activity Spreadsheet -- Enzyme Inhibition Constant Data from BindingDB
Found 5 hits for monomerid = 60279
Trg + Lig
Ki
nM
ΔG°
kcal/mole
IC50
nM
Kd
nM
EC50/IC50
nM
koff
s-1
kon
M-1s-1
pHTemp
°C
Kappa-type opioid receptor
(Homo sapiens (Human))
BDBM60279
(2-bromobenzenecarbothioic acid S-(8-quinolinyl) es...)
Show SMILES Brc1ccccc1C(=O)Sc1cccc2cccnc12
Show InChI InChI=1S/C16H10BrNOS/c17-13-8-2-1-7-12(13)16(19)20-14-9-3-5-11-6-4-10-18-15(11)14/h1-10H
Reactome pathway
PCBioAssay
n/an/a 1.05E+4n/an/an/an/an/an/a
Burnham Center for Chemical Genomics
Curated by PubChem BioAssay
Assay Description
Data Source: Sanford-Burnham Center for Chemical Genomics (SBCCG) Source Affiliation: Sanford-Burnham Medical Research Institute (SBMRI, San Diego, C...
PubChem Bioassay (2009)
BindingDB Entry DOI: 10.7270/Q20C4T6J
Apelin receptor
(Homo sapiens (Human))
BDBM60279
(2-bromobenzenecarbothioic acid S-(8-quinolinyl) es...)
Show SMILES Brc1ccccc1C(=O)Sc1cccc2cccnc12
Show InChI InChI=1S/C16H10BrNOS/c17-13-8-2-1-7-12(13)16(19)20-14-9-3-5-11-6-4-10-18-15(11)14/h1-10H
Reactome pathway
PCBioAssay
n/an/a>4.00E+4n/an/an/an/an/an/a
Sanford-Burnham Center for Chemical Genomics
Curated by PubChem BioAssay
Assay Description
Data Source: Sanford-Burnham Center for Chemical Genomics (SBCCG) Source Affiliation: Sanford- Sanford-Burnham Medical Research Institute(SBMRI, San...
PubChem Bioassay (2010)
BindingDB Entry DOI: 10.7270/Q2MK6BBZ
26S proteasome non-ATPase regulatory subunit 14
(Homo sapiens (Human))
BDBM60279
(2-bromobenzenecarbothioic acid S-(8-quinolinyl) es...)
Show SMILES Brc1ccccc1C(=O)Sc1cccc2cccnc12
Show InChI InChI=1S/C16H10BrNOS/c17-13-8-2-1-7-12(13)16(19)20-14-9-3-5-11-6-4-10-18-15(11)14/h1-10H
PCBioAssay
n/an/a 6.65E+3n/an/an/an/an/an/a
Burnham Center for Chemical Genomics
Curated by PubChem BioAssay
Assay Description
Data Source: Sanford-Burnham Center for Chemical Genomics (SBCCG) Source Affiliation: Sanford Burnham Medical Research Institute (SBMRI, La Jolla, CA...
PubChem Bioassay (2012)
BindingDB Entry DOI: 10.7270/Q2PC30Z9
Prothrombin
(Bos taurus (Bovine))
BDBM60279
(2-bromobenzenecarbothioic acid S-(8-quinolinyl) es...)
Show SMILES Brc1ccccc1C(=O)Sc1cccc2cccnc12
Show InChI InChI=1S/C16H10BrNOS/c17-13-8-2-1-7-12(13)16(19)20-14-9-3-5-11-6-4-10-18-15(11)14/h1-10H
PCBioAssay
n/an/a>1.00E+5n/an/an/an/an/an/a
Burnham Center for Chemical Genomics
Curated by PubChem BioAssay
Assay Description
Data Source: Sanford-Burnham Center for Chemical Genomics (SBCCG) Source Affiliation: Sanford Burnham Medical Research Institute (SBMRI, La Jolla, CA...
PubChem Bioassay (2012)
BindingDB Entry DOI: 10.7270/Q2JM286J
Type-1 angiotensin II receptor
(Homo sapiens (Human))
BDBM60279
(2-bromobenzenecarbothioic acid S-(8-quinolinyl) es...)
Show SMILES Brc1ccccc1C(=O)Sc1cccc2cccnc12
Show InChI InChI=1S/C16H10BrNOS/c17-13-8-2-1-7-12(13)16(19)20-14-9-3-5-11-6-4-10-18-15(11)14/h1-10H
Reactome pathway
PCBioAssay
n/an/a 3.51E+3n/an/an/an/an/an/a
Burnham Center for Chemical Genomics
Curated by PubChem BioAssay
Assay Description
Data Source: Sanford-Burnham Center for Chemical Genomics (SBCCG) Source Affiliation: Sanford-Burnham Medical Research Institute(SBMRI, San Diego, C...
PubChem Bioassay (2010)
BindingDB Entry DOI: 10.7270/Q2CJ8BXT