null
SMILES: OC(=O)c1ccc(cc1)-c1ccc(O)c(F)c1
InChI Key: InChIKey=WHAOIFHFUMILMM-UHFFFAOYSA-N
Activity Spreadsheet -- Enzyme Inhibition Constant Data from BindingDB
Found 1 hit for monomerid = 60395
Trg + Lig
Ki
nM
ΔG°
kcal/mole
IC50
nM
Kd
nM
EC50/IC50
nM
koff
s-1
kon
M-1s-1
pHTemp
°C
Large T antigen
(Simian virus 40)
BDBM60395
(4-(3-fluoranyl-4-oxidanyl-phenyl)benzoic acid | 4-...)
Show SMILES OC(=O)c1ccc(cc1)-c1ccc(O)c(F)c1
Show InChI InChI=1S/C13H9FO3/c14-11-7-10(5-6-12(11)15)8-1-3-9(4-2-8)13(16)17/h1-7,15H,(H,16,17)
PCBioAssay
n/an/a 6.76E+3n/an/an/an/an/an/a
Southern Research Specialized Biocontainment Screening Center
Curated by PubChem BioAssay
Assay Description
A biochemical assay using the ADP-Hunter methodology, purified TAg, and ATP to identify compounds that inhibit the ATPase activity of Tag Southern Re...
PubChem Bioassay (2010)
BindingDB Entry DOI: 10.7270/Q2M61HQ8