BDBM60418 US9056847, Fluorophore 2-cyclophellitol
SMILES: COc1ccc(cc1)C1=[N+]2C(C=C1)=C(CCCCc1cn(C[C@H]3[C@H]4O[C@H]4[C@H](O)[C@@H](O)[C@@H]3O)nn1)c1ccc(-c3ccc(OC)cc3)n1[B-]2(F)F
InChI Key: InChIKey=OWVDUFOFLDIMAR-SVBJHREWSA-N
Data: 1 KI
Activity Spreadsheet -- Enzyme Inhibition Constant Data from BindingDB
Found 1 hit for monomerid = 60418
Trg + Lig
Ki
nM
ΔG°
kcal/mole
IC50
nM
Kd
nM
EC50/IC50
nM
koff
s-1
kon
M-1s-1
pHTemp
°C
Lysosomal acid glucosylceramidase
(Homo sapiens (Human))
BDBM60418
(US9056847, Fluorophore 2-cyclophellitol)
Show SMILES COc1ccc(cc1)C1=[N+]2C(C=C1)=C(CCCCc1cn(C[C@H]3[C@H]4O[C@H]4[C@H](O)[C@@H](O)[C@@H]3O)nn1)c1ccc(-c3ccc(OC)cc3)n1[B-]2(F)F |r,c:12,t:9,14|
Show InChI InChI=1S/C36H38BF2N5O6/c1-48-24-11-7-21(8-12-24)28-15-17-30-26(31-18-16-29(44(31)37(38,39)43(28)30)22-9-13-25(49-2)14-10-22)6-4-3-5-23-19-42(41-40-23)20-27-32(45)33(46)34(47)36-35(27)50-36/h7-19,27,32-36,45-47H,3-6,20H2,1-2H3/t27-,32-,33+,34-,35-,36+/m1/s1
Reactome pathway
US Patent
1.56n/an/an/an/an/an/a5.2n/a
ACADEMISCH MEDISCH CENTRUM BIJ UNIVERSITEIT VAN AMSTERDAM
US Patent
Assay Description
Activity of GBA was measured at 37° C. with 4-methylumbelliferyl β-D-glucopyranoside as substrate as reported previously. To determine the IC50 ...
US Patent US9056847 (2015)
BindingDB Entry DOI: 10.7270/Q2CV4GG7