BDBM60581 [2-[[2-[4-[(6-Methoxycarbonyl-2-naphthyl)methoxycarbonyl]piperazin-1-yl]-2-oxoethyl]amino]-2-oxo-ethyl]-dimethyl-sulfonium bromide (1d)
SMILES: COC(=O)c1ccc2cc(COC(=O)N3CCN(CC3)C(=O)CNC(=O)C=C)ccc2c1
InChI Key: InChIKey=TXXYUCUSNRZUBP-UHFFFAOYSA-N
Data: 4 IC50
Activity Spreadsheet -- Enzyme Inhibition Constant Data from BindingDB
Found 4 hits for monomerid = 60581
Trg + Lig
Ki
nM
ΔG°
kcal/mole
IC50
nM
Kd
nM
EC50/IC50
nM
koff
s-1
kon
M-1s-1
pHTemp
°C
Protein-glutamine gamma-glutamyltransferase 2 (TG2)
(Homo sapiens (Human))
BDBM60581
([2-[[2-[4-[(6-Methoxycarbonyl-2-naphthyl)methoxyca...)
Show SMILES COC(=O)c1ccc2cc(COC(=O)N3CCN(CC3)C(=O)CNC(=O)C=C)ccc2c1
Show InChI InChI=1S/C23H25N3O6/c1-3-20(27)24-14-21(28)25-8-10-26(11-9-25)23(30)32-15-16-4-5-18-13-19(22(29)31-2)7-6-17(18)12-16/h3-7,12-13H,1,8-11,14-15H2,2H3,(H,24,27)
n/an/a 2.10E+3n/an/an/an/an/an/a
Aston University
Assay Description
For measurement of TG2 activity, the incorporation of biotinylated cadaverineinto immobilized N,N-dimethylcasein was used as described previously (Wa...
Chem Biol 22: 1347-61 (2015)
Article DOI: 10.1016/j.chembiol.2015.08.013
BindingDB Entry DOI: 10.7270/Q2222SJC
Coagulation factor XIII A (FXIIIa)
(Homo sapiens (Human))
BDBM60581
([2-[[2-[4-[(6-Methoxycarbonyl-2-naphthyl)methoxyca...)
Show SMILES COC(=O)c1ccc2cc(COC(=O)N3CCN(CC3)C(=O)CNC(=O)C=C)ccc2c1
Show InChI InChI=1S/C23H25N3O6/c1-3-20(27)24-14-21(28)25-8-10-26(11-9-25)23(30)32-15-16-4-5-18-13-19(22(29)31-2)7-6-17(18)12-16/h3-7,12-13H,1,8-11,14-15H2,2H3,(H,24,27)
n/an/a>1.00E+5n/an/an/an/an/an/a
Aston University
Assay Description
For measurement of TG2 activity, the incorporation of biotinylated cadaverineinto immobilized N,N-dimethylcasein was used as described previously (Wa...
Chem Biol 22: 1347-61 (2015)
Article DOI: 10.1016/j.chembiol.2015.08.013
BindingDB Entry DOI: 10.7270/Q2222SJC
Transglutaminase-3 (TG3)
(Homo sapiens (Human))
BDBM60581
([2-[[2-[4-[(6-Methoxycarbonyl-2-naphthyl)methoxyca...)
Show SMILES COC(=O)c1ccc2cc(COC(=O)N3CCN(CC3)C(=O)CNC(=O)C=C)ccc2c1
Show InChI InChI=1S/C23H25N3O6/c1-3-20(27)24-14-21(28)25-8-10-26(11-9-25)23(30)32-15-16-4-5-18-13-19(22(29)31-2)7-6-17(18)12-16/h3-7,12-13H,1,8-11,14-15H2,2H3,(H,24,27)
n/an/a>1.00E+5n/an/an/an/an/an/a
Aston University
Assay Description
For measurement of TG2 activity, the incorporation of biotinylated cadaverineinto immobilized N,N-dimethylcasein was used as described previously (Wa...
Chem Biol 22: 1347-61 (2015)
Article DOI: 10.1016/j.chembiol.2015.08.013
BindingDB Entry DOI: 10.7270/Q2222SJC
Transglutaminase-1 (TG1)
(Homo sapiens (Human))
BDBM60581
([2-[[2-[4-[(6-Methoxycarbonyl-2-naphthyl)methoxyca...)
Show SMILES COC(=O)c1ccc2cc(COC(=O)N3CCN(CC3)C(=O)CNC(=O)C=C)ccc2c1
Show InChI InChI=1S/C23H25N3O6/c1-3-20(27)24-14-21(28)25-8-10-26(11-9-25)23(30)32-15-16-4-5-18-13-19(22(29)31-2)7-6-17(18)12-16/h3-7,12-13H,1,8-11,14-15H2,2H3,(H,24,27)
n/an/a>1.00E+5n/an/an/an/an/an/a
Aston University
Assay Description
For measurement of TG2 activity, the incorporation of biotinylated cadaverineinto immobilized N,N-dimethylcasein was used as described previously (Wa...
Chem Biol 22: 1347-61 (2015)
Article DOI: 10.1016/j.chembiol.2015.08.013
BindingDB Entry DOI: 10.7270/Q2222SJC