BDBM60707 (4Z)-4-[[[4-(2-furanyl)-2-methylimino-3-thiazolyl]amino]methylidene]-2-hydroxy-1-cyclohexa-2,5-dienone::(4Z)-4-[[[4-(2-furyl)-2-methylimino-4-thiazolin-3-yl]amino]methylene]-2-hydroxy-cyclohexa-2,5-dien-1-one::(4Z)-4-[[[4-(furan-2-yl)-2-methylimino-1,3-thiazol-3-yl]amino]methylidene]-2-hydroxycyclohexa-2,5-dien-1-one::(4Z)-4-[[[4-(furan-2-yl)-2-methylimino-1,3-thiazol-3-yl]amino]methylidene]-2-oxidanyl-cyclohexa-2,5-dien-1-one::MLS000775648::SMR000370533::cid_16196512
SMILES: CN=c1scc(-c2ccco2)n1N=Cc1ccc(O)c(O)c1
InChI Key: InChIKey=UNEUVJKBKMVWKT-UHFFFAOYSA-N
Data: 4 IC50
Activity Spreadsheet -- Enzyme Inhibition Constant Data from BindingDB
Found 4 hits for monomerid = 60707
Trg + Lig
Ki
nM
ΔG°
kcal/mole
IC50
nM
Kd
nM
EC50/IC50
nM
koff
s-1
kon
M-1s-1
pHTemp
°C
Intestinal alkaline phosphatase
(Homo sapiens (Human))
BDBM60707
((4Z)-4-[[[4-(2-furanyl)-2-methylimino-3-thiazolyl]...)
Show SMILES CN=c1scc(-c2ccco2)n1N=Cc1ccc(O)c(O)c1 |w:12.13,1.0|
Show InChI InChI=1S/C15H13N3O3S/c1-16-15-18(11(9-22-15)14-3-2-6-21-14)17-8-10-4-5-12(19)13(20)7-10/h2-9,19-20H,1H3
PCBioAssay
n/an/a 1.34E+4n/an/an/an/an/an/a
Burnham Center for Chemical Genomics
Curated by PubChem BioAssay
Assay Description
Data Source: Sanford-Burnham Center for Chemical Genomics (SBCCG) Source Affiliation: Sanford-Burnham Medical Research Institute(SBMRI, San Diego, CA...
PubChem Bioassay (2010)
BindingDB Entry DOI: 10.7270/Q2X63KDM
Alpi
(Rattus norvegicus (Rat))
BDBM60707
((4Z)-4-[[[4-(2-furanyl)-2-methylimino-3-thiazolyl]...)
Show SMILES CN=c1scc(-c2ccco2)n1N=Cc1ccc(O)c(O)c1 |w:12.13,1.0|
Show InChI InChI=1S/C15H13N3O3S/c1-16-15-18(11(9-22-15)14-3-2-6-21-14)17-8-10-4-5-12(19)13(20)7-10/h2-9,19-20H,1H3
PCBioAssay
n/an/a 1.70E+3n/an/an/an/an/an/a
Burnham Center for Chemical Genomics
Curated by PubChem BioAssay
Assay Description
Data Source: Sanford-Burnham Center for Chemical Genomics (SBCCG) Source Affiliation: Sanford-Burnham Medical Research Institute (SBMRI, San Diego, C...
PubChem Bioassay (2010)
BindingDB Entry DOI: 10.7270/Q2DB809V
Alkaline phosphatase, tissue-nonspecific isozyme
(Homo sapiens (Human))
BDBM60707
((4Z)-4-[[[4-(2-furanyl)-2-methylimino-3-thiazolyl]...)
Show SMILES CN=c1scc(-c2ccco2)n1N=Cc1ccc(O)c(O)c1 |w:12.13,1.0|
Show InChI InChI=1S/C15H13N3O3S/c1-16-15-18(11(9-22-15)14-3-2-6-21-14)17-8-10-4-5-12(19)13(20)7-10/h2-9,19-20H,1H3
PCBioAssay
n/an/a 2.97E+4n/an/an/an/an/an/a
Burnham Center for Chemical Genomics
Curated by PubChem BioAssay
Assay Description
Data Source: Sanford-Burnham Center for Chemical Genomics (SBCCG) Source Affiliation: Sanford-Burnham Medical Research Institute (SBMRI, San Diego, C...
PubChem Bioassay (2010)
BindingDB Entry DOI: 10.7270/Q2H130G1
Alkaline phosphatase placental-like
(Homo sapiens (Human))
BDBM60707
((4Z)-4-[[[4-(2-furanyl)-2-methylimino-3-thiazolyl]...)
Show SMILES CN=c1scc(-c2ccco2)n1N=Cc1ccc(O)c(O)c1 |w:12.13,1.0|
Show InChI InChI=1S/C15H13N3O3S/c1-16-15-18(11(9-22-15)14-3-2-6-21-14)17-8-10-4-5-12(19)13(20)7-10/h2-9,19-20H,1H3
PCBioAssay
n/an/a>1.00E+5n/an/an/an/an/an/a
Burnham Center for Chemical Genomics
Curated by PubChem BioAssay
Assay Description
Data Source: Sanford-Burnham Center for Chemical Genomics (SBCCG) Source Affiliation: Sanford-Burnham Medical Research Institute (SBMRI, San Diego, C...
PubChem Bioassay (2010)
BindingDB Entry DOI: 10.7270/Q2NS0SCW