null
SMILES: COCCOCc1nc2cc(Cl)c3NC(=O)NC4(CCCCC4)c3c2o1
InChI Key:
Activity Spreadsheet -- Enzyme Inhibition Constant Data from BindingDB
Found 1 hit for monomerid = 607127
Trg + Lig
Ki
nM
ΔG°
kcal/mole
IC50
nM
Kd
nM
EC50/IC50
nM
koff
s-1
kon
M-1s-1
pHTemp
°C
cAMP-specific 3',5'-cyclic phosphodiesterase 7B
(Homo sapiens (Human))
BDBM607127
(US11685745, Example 5)
Show SMILES COCCOCc1nc2cc(Cl)c3NC(=O)NC4(CCCCC4)c3c2o1
Reactome pathway
n/an/a 55n/an/an/an/an/an/a
TBA
Citation and Details
BindingDB Entry DOI: 10.7270/Q2RF605F