null
SMILES: COC(=O)[C@@H]1CCCN(Cc2nc3cc(Cl)c4NC(=O)NC5(CCCCC5)c4c3o2)C1
InChI Key:
Activity Spreadsheet -- Enzyme Inhibition Constant Data from BindingDB
Found 1 hit for monomerid = 607213
Trg + Lig
Ki
nM
ΔG°
kcal/mole
IC50
nM
Kd
nM
EC50/IC50
nM
koff
s-1
kon
M-1s-1
pHTemp
°C
cAMP-specific 3',5'-cyclic phosphodiesterase 7B
(Homo sapiens (Human))
BDBM607213
(US11685745, Example 137)
Show SMILES COC(=O)[C@@H]1CCCN(Cc2nc3cc(Cl)c4NC(=O)NC5(CCCCC5)c4c3o2)C1 |r|
Reactome pathway
n/an/a 55n/an/an/an/an/an/a
TBA
Citation and Details
BindingDB Entry DOI: 10.7270/Q2RF605F