BDBM60962 hCA inhibitor, 2
SMILES: CCOC1Oc2c(F)cccc2C(=O)\C1=C/Nc1ccc(cc1)S(N)(=O)=O
InChI Key: InChIKey=UDHSGWXLHMTGFL-GXDHUFHOSA-N
Data: 3 KI
Activity Spreadsheet -- Enzyme Inhibition Constant Data from BindingDB
Found 3 hits for monomerid = 60962
Trg + Lig
Ki
nM
ΔG°
kcal/mole
IC50
nM
Kd
nM
EC50/IC50
nM
koff
s-1
kon
M-1s-1
pHTemp
°C
Carbonic anhydrase 2
(Homo sapiens (Human))
BDBM60962
(hCA inhibitor, 2)
Show SMILES CCOC1Oc2c(F)cccc2C(=O)\C1=C/Nc1ccc(cc1)S(N)(=O)=O
Show InChI InChI=1S/C18H17FN2O5S/c1-2-25-18-14(16(22)13-4-3-5-15(19)17(13)26-18)10-21-11-6-8-12(9-7-11)27(20,23)24/h3-10,18,21H,2H2,1H3,(H2,20,23,24)/b14-10+
Reactome pathway
437 -8.67n/an/an/an/an/a7.425
Ondokuz Mayis University
Assay Description
Carbonic anhydrase activity was assayed by following the change in absorbance at 348 nm of 4-nitrophenylacetate (NPA) to 4-nitrophenylate ion over a ...
J Enzyme Inhib Med Chem 27: 744-7 (2012)
Article DOI: 10.3109/14756366.2011.614607
BindingDB Entry DOI: 10.7270/Q2H70DQ2
Carbonic anhydrase 6 (CA-VI)
(Homo sapiens (Human))
BDBM60962
(hCA inhibitor, 2)
Show SMILES CCOC1Oc2c(F)cccc2C(=O)\C1=C/Nc1ccc(cc1)S(N)(=O)=O
Show InChI InChI=1S/C18H17FN2O5S/c1-2-25-18-14(16(22)13-4-3-5-15(19)17(13)26-18)10-21-11-6-8-12(9-7-11)27(20,23)24/h3-10,18,21H,2H2,1H3,(H2,20,23,24)/b14-10+
1.53E+3 -7.93n/an/an/an/an/a7.425
Ondokuz Mayis University
Assay Description
Carbonic anhydrase activity was assayed by following the change in absorbance at 348 nm of 4-nitrophenylacetate (NPA) to 4-nitrophenylate ion over a ...
J Enzyme Inhib Med Chem 27: 744-7 (2012)
Article DOI: 10.3109/14756366.2011.614607
BindingDB Entry DOI: 10.7270/Q2H70DQ2
Carbonic anhydrase 1
(Homo sapiens (Human))
BDBM60962
(hCA inhibitor, 2)
Show SMILES CCOC1Oc2c(F)cccc2C(=O)\C1=C/Nc1ccc(cc1)S(N)(=O)=O
Show InChI InChI=1S/C18H17FN2O5S/c1-2-25-18-14(16(22)13-4-3-5-15(19)17(13)26-18)10-21-11-6-8-12(9-7-11)27(20,23)24/h3-10,18,21H,2H2,1H3,(H2,20,23,24)/b14-10+
NCI pathway
Reactome pathway
3.72E+4 -6.04n/an/an/an/an/a7.425
Ondokuz Mayis University
Assay Description
Carbonic anhydrase activity was assayed by following the change in absorbance at 348 nm of 4-nitrophenylacetate (NPA) to 4-nitrophenylate ion over a ...
J Enzyme Inhib Med Chem 27: 744-7 (2012)
Article DOI: 10.3109/14756366.2011.614607
BindingDB Entry DOI: 10.7270/Q2H70DQ2