null
SMILES: OCCNc1nc2ncn(Cc3ccccc3)c2c(=O)[nH]1
InChI Key: InChIKey=VMYVSEIRFNZSPD-UHFFFAOYSA-N
Activity Spreadsheet -- Enzyme Inhibition Constant Data from BindingDB
Found 1 hit for monomerid = 61024
Trg + Lig
Ki
nM
ΔG°
kcal/mole
IC50
nM
Kd
nM
EC50/IC50
nM
koff
s-1
kon
M-1s-1
pHTemp
°C
G-protein coupled receptor 55
(Homo sapiens (Human))
BDBM61024
(2-(2-hydroxyethylamino)-7-(phenylmethyl)-3H-purin-...)
Show SMILES OCCNc1nc2ncn(Cc3ccccc3)c2c(=O)[nH]1
Show InChI InChI=1S/C14H15N5O2/c20-7-6-15-14-17-12-11(13(21)18-14)19(9-16-12)8-10-4-2-1-3-5-10/h1-5,9,20H,6-8H2,(H2,15,17,18,21)
Reactome pathway
PCBioAssay
n/an/an/an/a 3.20E+4n/an/an/an/a
Burnham Center for Chemical Genomics
Curated by PubChem BioAssay
Assay Description
Data Source: Sanford-Burnham Center for Chemical Genomics (SBCCG) Source Affiliation: Sanford-Burnham Medical Research Institute (SBMRI, San Diego, C...
PubChem Bioassay (2010)
BindingDB Entry DOI: 10.7270/Q2GF0RZ3