BDBM61102 2-(2-chlorophenyl)-1H-benzimidazole::MLS000738196::SMR000448531::US9138393, 2-(2-Chlorophenyl) benzimidazole::US9144538, 2-(2-Chlorophenyl) benzimidazole::cid_77123
SMILES: Clc1ccccc1-c1nc2ccccc2[nH]1
InChI Key: InChIKey=OILIYWFQRJOPAI-UHFFFAOYSA-N
Data: 2 IC50  1 EC50
Activity Spreadsheet -- Enzyme Inhibition Constant Data from BindingDB
Found 3 hits for monomerid = 61102
Trg + Lig
Ki
nM
ΔG°
kcal/mole
IC50
nM
Kd
nM
EC50/IC50
nM
koff
s-1
kon
M-1s-1
pHTemp
°C
G-protein coupled receptor 55
(Homo sapiens (Human))
BDBM61102
(2-(2-chlorophenyl)-1H-benzimidazole | MLS000738196...)
Show SMILES Clc1ccccc1-c1nc2ccccc2[nH]1
Show InChI InChI=1S/C13H9ClN2/c14-10-6-2-1-5-9(10)13-15-11-7-3-4-8-12(11)16-13/h1-8H,(H,15,16)
Reactome pathway
PCBioAssay
n/an/an/an/a 2.24E+3n/an/an/an/a
Burnham Center for Chemical Genomics
Curated by PubChem BioAssay
Assay Description
Data Source: Sanford-Burnham Center for Chemical Genomics (SBCCG) Source Affiliation: Sanford-Burnham Medical Research Institute (SBMRI, San Diego, C...
PubChem Bioassay (2010)
BindingDB Entry DOI: 10.7270/Q2GF0RZ3
Cytochrome P450 3A4
(Homo sapiens (Human))
BDBM61102
(2-(2-chlorophenyl)-1H-benzimidazole | MLS000738196...)
Show SMILES Clc1ccccc1-c1nc2ccccc2[nH]1
Show InChI InChI=1S/C13H9ClN2/c14-10-6-2-1-5-9(10)13-15-11-7-3-4-8-12(11)16-13/h1-8H,(H,15,16)
Reactome pathway
US Patent
n/an/a>1.00E+4n/an/an/an/an/an/a
The Procter & Gamble Company
US Patent
Assay Description
Cytochrome P450 is a large and diverse group of enzymes that catalyze the oxidation of organic substances. Some members of the CYP family contribute ...
US Patent US9144538 (2015)
BindingDB Entry DOI: 10.7270/Q22806DV
Cytochrome P450 3A4
(Homo sapiens (Human))
BDBM61102
(2-(2-chlorophenyl)-1H-benzimidazole | MLS000738196...)
Show SMILES Clc1ccccc1-c1nc2ccccc2[nH]1
Show InChI InChI=1S/C13H9ClN2/c14-10-6-2-1-5-9(10)13-15-11-7-3-4-8-12(11)16-13/h1-8H,(H,15,16)
Reactome pathway
US Patent
n/an/a>1.00E+4n/an/an/an/an/an/a
The Procter & Gamble Company
US Patent
Assay Description
A commercially available P450-GLO Assay kit (Promega Corporation, Madison Wis.) is used to screen various compounds for CYP3A4A inhibition activity. ...
US Patent US9138393 (2015)
BindingDB Entry DOI: 10.7270/Q2GF0S8J