null
SMILES: Fc1ccc2oc(cc2c1)S(=O)(=O)N1CCCC1C(=O)NCc1ccnc(c1)-c1ccc(nc1)C(F)(F)F
InChI Key:
Activity Spreadsheet -- Enzyme Inhibition Constant Data from BindingDB
Found 1 hit for monomerid = 611240
Trg + Lig
Ki
nM
ΔG°
kcal/mole
IC50
nM
Kd
nM
EC50/IC50
nM
koff
s-1
kon
M-1s-1
pHTemp
°C
Transient receptor potential cation channel subfamily A member 1
(Homo sapiens (Human))
BDBM611240
((2S)-1-(5-fluorobenzofuran-2- yl)sulfonyl-N-[[2-[6...)
Show SMILES Fc1ccc2oc(cc2c1)S(=O)(=O)N1CCCC1C(=O)NCc1ccnc(c1)-c1ccc(nc1)C(F)(F)F
n/an/a 0.830n/an/an/an/an/an/a
TBA
Citation and Details
BindingDB Entry DOI: 10.7270/Q2Q81J54