null
SMILES: CN1CCN(CCCNc2cc3nc(NC(=O)NC(C)(C)C)c(cc3cn2)-c2ccccc2)CC1
InChI Key: InChIKey=YHWIDOWCIUQFLW-UHFFFAOYSA-N
Activity Spreadsheet -- Enzyme Inhibition Constant Data from BindingDB
Found 4 hits for monomerid = 6159
Trg + Lig
Ki
nM
ΔG°
kcal/mole
IC50
nM
Kd
nM
EC50/IC50
nM
koff
s-1
kon
M-1s-1
pHTemp
°C
Platelet-derived growth factor receptor beta
(Mus musculus (mouse))
BDBM6159
(1,6-naphthyridine 28 | 3-tert-butyl-1-(7-{[3-(4-me...)
Show SMILES CN1CCN(CCCNc2cc3nc(NC(=O)NC(C)(C)C)c(cc3cn2)-c2ccccc2)CC1
Show InChI InChI=1S/C27H37N7O/c1-27(2,3)32-26(35)31-25-22(20-9-6-5-7-10-20)17-21-19-29-24(18-23(21)30-25)28-11-8-12-34-15-13-33(4)14-16-34/h5-7,9-10,17-19H,8,11-16H2,1-4H3,(H,28,29)(H2,30,31,32,35)
n/an/a 1.20E+3n/an/an/an/an/an/a
University of Auckland
Assay Description
Compounds were evaluated for their ability to prevent phosphorylation of a model glutamate-tyrosine copolymer substrate by isolated human FGFR-1, mou...
J Med Chem 48: 4628-53 (2005)
Article DOI: 10.1021/jm0500931
BindingDB Entry DOI: 10.7270/Q2DV1H3W
Vascular endothelial growth factor receptor 2
(Homo sapiens (Human))
BDBM6159
(1,6-naphthyridine 28 | 3-tert-butyl-1-(7-{[3-(4-me...)
Show SMILES CN1CCN(CCCNc2cc3nc(NC(=O)NC(C)(C)C)c(cc3cn2)-c2ccccc2)CC1
Show InChI InChI=1S/C27H37N7O/c1-27(2,3)32-26(35)31-25-22(20-9-6-5-7-10-20)17-21-19-29-24(18-23(21)30-25)28-11-8-12-34-15-13-33(4)14-16-34/h5-7,9-10,17-19H,8,11-16H2,1-4H3,(H,28,29)(H2,30,31,32,35)
NCI pathway
Reactome pathway
n/an/a 54n/an/an/an/an/an/a
University of Auckland
Assay Description
Tha assay was using human VEGFR-2 in DELFIA (dissociation-enhanced lanthanide fluoroimmunoassay) format. IC50 is the concentration of inhibitor that ...
J Med Chem 48: 4628-53 (2005)
Article DOI: 10.1021/jm0500931
BindingDB Entry DOI: 10.7270/Q2DV1H3W
Proto-oncogene tyrosine-protein kinase Src
(Homo sapiens (Human))
BDBM6159
(1,6-naphthyridine 28 | 3-tert-butyl-1-(7-{[3-(4-me...)
Show SMILES CN1CCN(CCCNc2cc3nc(NC(=O)NC(C)(C)C)c(cc3cn2)-c2ccccc2)CC1
Show InChI InChI=1S/C27H37N7O/c1-27(2,3)32-26(35)31-25-22(20-9-6-5-7-10-20)17-21-19-29-24(18-23(21)30-25)28-11-8-12-34-15-13-33(4)14-16-34/h5-7,9-10,17-19H,8,11-16H2,1-4H3,(H,28,29)(H2,30,31,32,35)
n/an/a 230n/an/an/an/an/an/a
University of Auckland
Assay Description
Compounds were evaluated for their ability to prevent phosphorylation of a model glutamate-tyrosine copolymer substrate by isolated human FGFR-1, mou...
J Med Chem 48: 4628-53 (2005)
Article DOI: 10.1021/jm0500931
BindingDB Entry DOI: 10.7270/Q2DV1H3W
Fibroblast growth factor receptor 1
(Homo sapiens (Human))
BDBM6159
(1,6-naphthyridine 28 | 3-tert-butyl-1-(7-{[3-(4-me...)
Show SMILES CN1CCN(CCCNc2cc3nc(NC(=O)NC(C)(C)C)c(cc3cn2)-c2ccccc2)CC1
Show InChI InChI=1S/C27H37N7O/c1-27(2,3)32-26(35)31-25-22(20-9-6-5-7-10-20)17-21-19-29-24(18-23(21)30-25)28-11-8-12-34-15-13-33(4)14-16-34/h5-7,9-10,17-19H,8,11-16H2,1-4H3,(H,28,29)(H2,30,31,32,35)
NCI pathway
Reactome pathway
n/an/a 190n/an/an/an/an/an/a
University of Auckland
Assay Description
Compounds were evaluated for their ability to prevent phosphorylation of a model glutamate-tyrosine copolymer substrate by isolated human FGFR-1, mou...
J Med Chem 48: 4628-53 (2005)
Article DOI: 10.1021/jm0500931
BindingDB Entry DOI: 10.7270/Q2DV1H3W