null
SMILES: CN1CCN(CCCNc2cc3nc(N)c(cc3cn2)-c2c(Cl)cccc2Cl)CC1
InChI Key: InChIKey=KAENRXVOSSXXKH-UHFFFAOYSA-N
Activity Spreadsheet -- Enzyme Inhibition Constant Data from BindingDB
Found 4 hits for monomerid = 6163
Trg + Lig
Ki
nM
ΔG°
kcal/mole
IC50
nM
Kd
nM
EC50/IC50
nM
koff
s-1
kon
M-1s-1
pHTemp
°C
Platelet-derived growth factor receptor beta
(Mus musculus (mouse))
BDBM6163
(1,6-naphthyridine 32 | 3-(2,6-dichlorophenyl)-7-N-...)
Show SMILES CN1CCN(CCCNc2cc3nc(N)c(cc3cn2)-c2c(Cl)cccc2Cl)CC1 |(-11.94,-2.96,;-10.6,-2.19,;-10.6,-.65,;-9.27,.12,;-7.94,-.65,;-6.85,.44,;-5.36,.04,;-4.27,1.13,;-2.78,.73,;-1.45,1.5,;-.12,.73,;1.22,1.5,;2.55,.73,;3.88,1.5,;5.22,.73,;3.88,3.05,;2.55,3.82,;1.22,3.05,;-.12,3.82,;-1.45,3.05,;5.22,3.82,;6.52,3,;6.47,1.46,;7.88,3.72,;7.94,5.26,;6.63,6.08,;5.27,5.35,;3.97,6.17,;-7.94,-2.19,;-9.27,-2.96,)|
Show InChI InChI=1S/C22H26Cl2N6/c1-29-8-10-30(11-9-29)7-3-6-26-20-13-19-15(14-27-20)12-16(22(25)28-19)21-17(23)4-2-5-18(21)24/h2,4-5,12-14H,3,6-11H2,1H3,(H2,25,28)(H,26,27)
n/an/a 4.70E+3n/an/an/an/an/an/a
University of Auckland
Assay Description
Compounds were evaluated for their ability to prevent phosphorylation of a model glutamate-tyrosine copolymer substrate by isolated human FGFR-1, mou...
J Med Chem 48: 4628-53 (2005)
Article DOI: 10.1021/jm0500931
BindingDB Entry DOI: 10.7270/Q2DV1H3W
Vascular endothelial growth factor receptor 2
(Homo sapiens (Human))
BDBM6163
(1,6-naphthyridine 32 | 3-(2,6-dichlorophenyl)-7-N-...)
Show SMILES CN1CCN(CCCNc2cc3nc(N)c(cc3cn2)-c2c(Cl)cccc2Cl)CC1 |(-11.94,-2.96,;-10.6,-2.19,;-10.6,-.65,;-9.27,.12,;-7.94,-.65,;-6.85,.44,;-5.36,.04,;-4.27,1.13,;-2.78,.73,;-1.45,1.5,;-.12,.73,;1.22,1.5,;2.55,.73,;3.88,1.5,;5.22,.73,;3.88,3.05,;2.55,3.82,;1.22,3.05,;-.12,3.82,;-1.45,3.05,;5.22,3.82,;6.52,3,;6.47,1.46,;7.88,3.72,;7.94,5.26,;6.63,6.08,;5.27,5.35,;3.97,6.17,;-7.94,-2.19,;-9.27,-2.96,)|
Show InChI InChI=1S/C22H26Cl2N6/c1-29-8-10-30(11-9-29)7-3-6-26-20-13-19-15(14-27-20)12-16(22(25)28-19)21-17(23)4-2-5-18(21)24/h2,4-5,12-14H,3,6-11H2,1H3,(H2,25,28)(H,26,27)
NCI pathway
Reactome pathway
n/an/a 1.80E+3n/an/an/an/an/an/a
University of Auckland
Assay Description
Tha assay was using human VEGFR-2 in DELFIA (dissociation-enhanced lanthanide fluoroimmunoassay) format. IC50 is the concentration of inhibitor that ...
J Med Chem 48: 4628-53 (2005)
Article DOI: 10.1021/jm0500931
BindingDB Entry DOI: 10.7270/Q2DV1H3W
Proto-oncogene tyrosine-protein kinase Src
(Homo sapiens (Human))
BDBM6163
(1,6-naphthyridine 32 | 3-(2,6-dichlorophenyl)-7-N-...)
Show SMILES CN1CCN(CCCNc2cc3nc(N)c(cc3cn2)-c2c(Cl)cccc2Cl)CC1 |(-11.94,-2.96,;-10.6,-2.19,;-10.6,-.65,;-9.27,.12,;-7.94,-.65,;-6.85,.44,;-5.36,.04,;-4.27,1.13,;-2.78,.73,;-1.45,1.5,;-.12,.73,;1.22,1.5,;2.55,.73,;3.88,1.5,;5.22,.73,;3.88,3.05,;2.55,3.82,;1.22,3.05,;-.12,3.82,;-1.45,3.05,;5.22,3.82,;6.52,3,;6.47,1.46,;7.88,3.72,;7.94,5.26,;6.63,6.08,;5.27,5.35,;3.97,6.17,;-7.94,-2.19,;-9.27,-2.96,)|
Show InChI InChI=1S/C22H26Cl2N6/c1-29-8-10-30(11-9-29)7-3-6-26-20-13-19-15(14-27-20)12-16(22(25)28-19)21-17(23)4-2-5-18(21)24/h2,4-5,12-14H,3,6-11H2,1H3,(H2,25,28)(H,26,27)
n/an/a 69n/an/an/an/an/an/a
University of Auckland
Assay Description
Compounds were evaluated for their ability to prevent phosphorylation of a model glutamate-tyrosine copolymer substrate by isolated human FGFR-1, mou...
J Med Chem 48: 4628-53 (2005)
Article DOI: 10.1021/jm0500931
BindingDB Entry DOI: 10.7270/Q2DV1H3W
Fibroblast growth factor receptor 1
(Homo sapiens (Human))
BDBM6163
(1,6-naphthyridine 32 | 3-(2,6-dichlorophenyl)-7-N-...)
Show SMILES CN1CCN(CCCNc2cc3nc(N)c(cc3cn2)-c2c(Cl)cccc2Cl)CC1 |(-11.94,-2.96,;-10.6,-2.19,;-10.6,-.65,;-9.27,.12,;-7.94,-.65,;-6.85,.44,;-5.36,.04,;-4.27,1.13,;-2.78,.73,;-1.45,1.5,;-.12,.73,;1.22,1.5,;2.55,.73,;3.88,1.5,;5.22,.73,;3.88,3.05,;2.55,3.82,;1.22,3.05,;-.12,3.82,;-1.45,3.05,;5.22,3.82,;6.52,3,;6.47,1.46,;7.88,3.72,;7.94,5.26,;6.63,6.08,;5.27,5.35,;3.97,6.17,;-7.94,-2.19,;-9.27,-2.96,)|
Show InChI InChI=1S/C22H26Cl2N6/c1-29-8-10-30(11-9-29)7-3-6-26-20-13-19-15(14-27-20)12-16(22(25)28-19)21-17(23)4-2-5-18(21)24/h2,4-5,12-14H,3,6-11H2,1H3,(H2,25,28)(H,26,27)
NCI pathway
Reactome pathway
n/an/a 120n/an/an/an/an/an/a
University of Auckland
Assay Description
Compounds were evaluated for their ability to prevent phosphorylation of a model glutamate-tyrosine copolymer substrate by isolated human FGFR-1, mou...
J Med Chem 48: 4628-53 (2005)
Article DOI: 10.1021/jm0500931
BindingDB Entry DOI: 10.7270/Q2DV1H3W