BDBM61669 (4-acetamidophenyl) 6-bromanyl-2-oxidanylidene-chromene-3-carboxylate::(4-acetamidophenyl) 6-bromo-2-oxochromene-3-carboxylate::4-(acetylamino)phenyl 6-bromo-2-oxo-2H-chromene-3-carboxylate::6-bromo-2-keto-chromene-3-carboxylic acid (4-acetamidophenyl) ester::6-bromo-2-oxo-1-benzopyran-3-carboxylic acid (4-acetamidophenyl) ester::MLS000571689::SMR000193698::cid_2231010
SMILES: CC(=O)Nc1ccc(OC(=O)c2cc3cc(Br)ccc3oc2=O)cc1
InChI Key: InChIKey=FTZBKSXISWDOEG-UHFFFAOYSA-N
Data: 1 IC50
Activity Spreadsheet -- Enzyme Inhibition Constant Data from BindingDB
Found 1 hit for monomerid = 61669
Trg + Lig
Ki
nM
ΔG°
kcal/mole
IC50
nM
Kd
nM
EC50/IC50
nM
koff
s-1
kon
M-1s-1
pHTemp
°C
Voltage-gated calcium channel subunit alpha Cav2.2
(Homo sapiens (Human))
BDBM61669
((4-acetamidophenyl) 6-bromanyl-2-oxidanylidene-chr...)
Show SMILES CC(=O)Nc1ccc(OC(=O)c2cc3cc(Br)ccc3oc2=O)cc1
Show InChI InChI=1S/C18H12BrNO5/c1-10(21)20-13-3-5-14(6-4-13)24-17(22)15-9-11-8-12(19)2-7-16(11)25-18(15)23/h2-9H,1H3,(H,20,21)
PCBioAssay
n/an/a 2.00E+3n/an/an/an/an/an/a
Burnham Center for Chemical Genomics
Curated by PubChem BioAssay
Assay Description
Data Source: Data Source: Sanford-Burnham Center for Chemical Genomics (SBCCG) Source Affiliation: Sanford-Burnham Medical Research Institute Network...
PubChem Bioassay (2009)
BindingDB Entry DOI: 10.7270/Q2PZ578V