null
SMILES: CCNC(=O)Nc1nc2cc(NCCCCN(CC)CC)ncc2cc1-c1c(Cl)cccc1Cl
InChI Key: InChIKey=QVJHVQPCRIXTMX-UHFFFAOYSA-N
Activity Spreadsheet -- Enzyme Inhibition Constant Data from BindingDB
Found 4 hits for monomerid = 6167
Trg + Lig
Ki
nM
ΔG°
kcal/mole
IC50
nM
Kd
nM
EC50/IC50
nM
koff
s-1
kon
M-1s-1
pHTemp
°C
Platelet-derived growth factor receptor beta
(Mus musculus (mouse))
BDBM6167
(1,6-naphthyridine 36 | 1-[3-(2,6-dichlorophenyl)-7...)
Show SMILES CCNC(=O)Nc1nc2cc(NCCCCN(CC)CC)ncc2cc1-c1c(Cl)cccc1Cl |(2.55,-3.89,;3.88,-3.12,;3.88,-1.58,;5.22,-.81,;6.55,-1.58,;5.22,.73,;3.88,1.5,;2.55,.73,;1.22,1.5,;-.12,.73,;-1.45,1.5,;-2.78,.73,;-4.27,1.13,;-5.36,.04,;-6.85,.44,;-7.94,-.65,;-9.42,-.25,;-9.82,1.24,;-11.31,1.64,;-10.51,-1.34,;-12,-.94,;-1.45,3.05,;-.12,3.82,;1.22,3.05,;2.55,3.82,;3.88,3.05,;5.22,3.82,;6.52,3,;6.47,1.46,;7.88,3.72,;7.94,5.26,;6.63,6.08,;5.27,5.35,;3.97,6.17,)|
Show InChI InChI=1S/C25H32Cl2N6O/c1-4-28-25(34)32-24-18(23-19(26)10-9-11-20(23)27)14-17-16-30-22(15-21(17)31-24)29-12-7-8-13-33(5-2)6-3/h9-11,14-16H,4-8,12-13H2,1-3H3,(H,29,30)(H2,28,31,32,34)
n/an/a 160n/an/an/an/an/an/a
University of Auckland
Assay Description
Compounds were evaluated for their ability to prevent phosphorylation of a model glutamate-tyrosine copolymer substrate by isolated human FGFR-1, mou...
J Med Chem 48: 4628-53 (2005)
Article DOI: 10.1021/jm0500931
BindingDB Entry DOI: 10.7270/Q2DV1H3W
Vascular endothelial growth factor receptor 2
(Homo sapiens (Human))
BDBM6167
(1,6-naphthyridine 36 | 1-[3-(2,6-dichlorophenyl)-7...)
Show SMILES CCNC(=O)Nc1nc2cc(NCCCCN(CC)CC)ncc2cc1-c1c(Cl)cccc1Cl |(2.55,-3.89,;3.88,-3.12,;3.88,-1.58,;5.22,-.81,;6.55,-1.58,;5.22,.73,;3.88,1.5,;2.55,.73,;1.22,1.5,;-.12,.73,;-1.45,1.5,;-2.78,.73,;-4.27,1.13,;-5.36,.04,;-6.85,.44,;-7.94,-.65,;-9.42,-.25,;-9.82,1.24,;-11.31,1.64,;-10.51,-1.34,;-12,-.94,;-1.45,3.05,;-.12,3.82,;1.22,3.05,;2.55,3.82,;3.88,3.05,;5.22,3.82,;6.52,3,;6.47,1.46,;7.88,3.72,;7.94,5.26,;6.63,6.08,;5.27,5.35,;3.97,6.17,)|
Show InChI InChI=1S/C25H32Cl2N6O/c1-4-28-25(34)32-24-18(23-19(26)10-9-11-20(23)27)14-17-16-30-22(15-21(17)31-24)29-12-7-8-13-33(5-2)6-3/h9-11,14-16H,4-8,12-13H2,1-3H3,(H,29,30)(H2,28,31,32,34)
NCI pathway
Reactome pathway
n/an/a 130n/an/an/an/an/an/a
University of Auckland
Assay Description
Tha assay was using human VEGFR-2 in DELFIA (dissociation-enhanced lanthanide fluoroimmunoassay) format. IC50 is the concentration of inhibitor that ...
J Med Chem 48: 4628-53 (2005)
Article DOI: 10.1021/jm0500931
BindingDB Entry DOI: 10.7270/Q2DV1H3W
Proto-oncogene tyrosine-protein kinase Src
(Homo sapiens (Human))
BDBM6167
(1,6-naphthyridine 36 | 1-[3-(2,6-dichlorophenyl)-7...)
Show SMILES CCNC(=O)Nc1nc2cc(NCCCCN(CC)CC)ncc2cc1-c1c(Cl)cccc1Cl |(2.55,-3.89,;3.88,-3.12,;3.88,-1.58,;5.22,-.81,;6.55,-1.58,;5.22,.73,;3.88,1.5,;2.55,.73,;1.22,1.5,;-.12,.73,;-1.45,1.5,;-2.78,.73,;-4.27,1.13,;-5.36,.04,;-6.85,.44,;-7.94,-.65,;-9.42,-.25,;-9.82,1.24,;-11.31,1.64,;-10.51,-1.34,;-12,-.94,;-1.45,3.05,;-.12,3.82,;1.22,3.05,;2.55,3.82,;3.88,3.05,;5.22,3.82,;6.52,3,;6.47,1.46,;7.88,3.72,;7.94,5.26,;6.63,6.08,;5.27,5.35,;3.97,6.17,)|
Show InChI InChI=1S/C25H32Cl2N6O/c1-4-28-25(34)32-24-18(23-19(26)10-9-11-20(23)27)14-17-16-30-22(15-21(17)31-24)29-12-7-8-13-33(5-2)6-3/h9-11,14-16H,4-8,12-13H2,1-3H3,(H,29,30)(H2,28,31,32,34)
n/an/a 14n/an/an/an/an/an/a
University of Auckland
Assay Description
Compounds were evaluated for their ability to prevent phosphorylation of a model glutamate-tyrosine copolymer substrate by isolated human FGFR-1, mou...
J Med Chem 48: 4628-53 (2005)
Article DOI: 10.1021/jm0500931
BindingDB Entry DOI: 10.7270/Q2DV1H3W
Fibroblast growth factor receptor 1
(Homo sapiens (Human))
BDBM6167
(1,6-naphthyridine 36 | 1-[3-(2,6-dichlorophenyl)-7...)
Show SMILES CCNC(=O)Nc1nc2cc(NCCCCN(CC)CC)ncc2cc1-c1c(Cl)cccc1Cl |(2.55,-3.89,;3.88,-3.12,;3.88,-1.58,;5.22,-.81,;6.55,-1.58,;5.22,.73,;3.88,1.5,;2.55,.73,;1.22,1.5,;-.12,.73,;-1.45,1.5,;-2.78,.73,;-4.27,1.13,;-5.36,.04,;-6.85,.44,;-7.94,-.65,;-9.42,-.25,;-9.82,1.24,;-11.31,1.64,;-10.51,-1.34,;-12,-.94,;-1.45,3.05,;-.12,3.82,;1.22,3.05,;2.55,3.82,;3.88,3.05,;5.22,3.82,;6.52,3,;6.47,1.46,;7.88,3.72,;7.94,5.26,;6.63,6.08,;5.27,5.35,;3.97,6.17,)|
Show InChI InChI=1S/C25H32Cl2N6O/c1-4-28-25(34)32-24-18(23-19(26)10-9-11-20(23)27)14-17-16-30-22(15-21(17)31-24)29-12-7-8-13-33(5-2)6-3/h9-11,14-16H,4-8,12-13H2,1-3H3,(H,29,30)(H2,28,31,32,34)
NCI pathway
Reactome pathway
n/an/a 29n/an/an/an/an/an/a
University of Auckland
Assay Description
Compounds were evaluated for their ability to prevent phosphorylation of a model glutamate-tyrosine copolymer substrate by isolated human FGFR-1, mou...
J Med Chem 48: 4628-53 (2005)
Article DOI: 10.1021/jm0500931
BindingDB Entry DOI: 10.7270/Q2DV1H3W