BDBM6178 1,6-naphthyridine 75::3-tert-butyl-1-[3-(3,5-dimethoxyphenyl)-7-[(3-hydroxypropyl)amino]-1,6-naphthyridin-2-yl]urea::N-(tert-Butyl)-N -[3-(3,5-dimethoxyphenyl)-7-[(3-hydroxypropyl)amino]-1,6-naphthyridin-2-yl]urea
SMILES: COc1cc(OC)cc(c1)-c1cc2cnc(NCCCO)cc2nc1NC(=O)NC(C)(C)C
InChI Key: InChIKey=JAYZLGOACZERIJ-UHFFFAOYSA-N
Data: 4 IC50
Activity Spreadsheet -- Enzyme Inhibition Constant Data from BindingDB
Found 4 hits for monomerid = 6178
Trg + Lig
Ki
nM
ΔG°
kcal/mole
IC50
nM
Kd
nM
EC50/IC50
nM
koff
s-1
kon
M-1s-1
pHTemp
°C
Platelet-derived growth factor receptor beta
(Mus musculus (mouse))
BDBM6178
(1,6-naphthyridine 75 | 3-tert-butyl-1-[3-(3,5-dime...)
Show SMILES COc1cc(OC)cc(c1)-c1cc2cnc(NCCCO)cc2nc1NC(=O)NC(C)(C)C
Show InChI InChI=1S/C24H31N5O4/c1-24(2,3)29-23(31)28-22-19(15-9-17(32-4)12-18(10-15)33-5)11-16-14-26-21(13-20(16)27-22)25-7-6-8-30/h9-14,30H,6-8H2,1-5H3,(H,25,26)(H2,27,28,29,31)
n/an/a 3.20E+4n/an/an/an/an/an/a
University of Auckland
Assay Description
Compounds were evaluated for their ability to prevent phosphorylation of a model glutamate-tyrosine copolymer substrate by isolated human FGFR-1, mou...
J Med Chem 48: 4628-53 (2005)
Article DOI: 10.1021/jm0500931
BindingDB Entry DOI: 10.7270/Q2DV1H3W
Vascular endothelial growth factor receptor 2
(Homo sapiens (Human))
BDBM6178
(1,6-naphthyridine 75 | 3-tert-butyl-1-[3-(3,5-dime...)
Show SMILES COc1cc(OC)cc(c1)-c1cc2cnc(NCCCO)cc2nc1NC(=O)NC(C)(C)C
Show InChI InChI=1S/C24H31N5O4/c1-24(2,3)29-23(31)28-22-19(15-9-17(32-4)12-18(10-15)33-5)11-16-14-26-21(13-20(16)27-22)25-7-6-8-30/h9-14,30H,6-8H2,1-5H3,(H,25,26)(H2,27,28,29,31)
NCI pathway
Reactome pathway
n/an/a 5n/an/an/an/an/an/a
University of Auckland
Assay Description
Tha assay was using human VEGFR-2 in DELFIA (dissociation-enhanced lanthanide fluoroimmunoassay) format. IC50 is the concentration of inhibitor that ...
J Med Chem 48: 4628-53 (2005)
Article DOI: 10.1021/jm0500931
BindingDB Entry DOI: 10.7270/Q2DV1H3W
Proto-oncogene tyrosine-protein kinase Src
(Homo sapiens (Human))
BDBM6178
(1,6-naphthyridine 75 | 3-tert-butyl-1-[3-(3,5-dime...)
Show SMILES COc1cc(OC)cc(c1)-c1cc2cnc(NCCCO)cc2nc1NC(=O)NC(C)(C)C
Show InChI InChI=1S/C24H31N5O4/c1-24(2,3)29-23(31)28-22-19(15-9-17(32-4)12-18(10-15)33-5)11-16-14-26-21(13-20(16)27-22)25-7-6-8-30/h9-14,30H,6-8H2,1-5H3,(H,25,26)(H2,27,28,29,31)
n/an/a>5.00E+4n/an/an/an/an/an/a
University of Auckland
Assay Description
Compounds were evaluated for their ability to prevent phosphorylation of a model glutamate-tyrosine copolymer substrate by isolated human FGFR-1, mou...
J Med Chem 48: 4628-53 (2005)
Article DOI: 10.1021/jm0500931
BindingDB Entry DOI: 10.7270/Q2DV1H3W
Fibroblast growth factor receptor 1
(Homo sapiens (Human))
BDBM6178
(1,6-naphthyridine 75 | 3-tert-butyl-1-[3-(3,5-dime...)
Show SMILES COc1cc(OC)cc(c1)-c1cc2cnc(NCCCO)cc2nc1NC(=O)NC(C)(C)C
Show InChI InChI=1S/C24H31N5O4/c1-24(2,3)29-23(31)28-22-19(15-9-17(32-4)12-18(10-15)33-5)11-16-14-26-21(13-20(16)27-22)25-7-6-8-30/h9-14,30H,6-8H2,1-5H3,(H,25,26)(H2,27,28,29,31)
NCI pathway
Reactome pathway
n/an/a 49n/an/an/an/an/an/a
University of Auckland
Assay Description
Compounds were evaluated for their ability to prevent phosphorylation of a model glutamate-tyrosine copolymer substrate by isolated human FGFR-1, mou...
J Med Chem 48: 4628-53 (2005)
Article DOI: 10.1021/jm0500931
BindingDB Entry DOI: 10.7270/Q2DV1H3W