BDBM6180 1,6-naphthyridine 77::3-tert-butyl-1-[3-(3,5-dimethoxyphenyl)-7-[(5-hydroxypentyl)amino]-1,6-naphthyridin-2-yl]urea::N-(tert-Butyl)-N -[3-(3,5-dimethoxyphenyl)-7-[(5-hydroxypentyl)amino]-1,6-naphthyridin-2-yl]urea
SMILES: COc1cc(OC)cc(c1)-c1cc2cnc(NCCCCCO)cc2nc1NC(=O)NC(C)(C)C
InChI Key: InChIKey=PYUIBNGQBBAKFO-UHFFFAOYSA-N
Data: 4 IC50
Activity Spreadsheet -- Enzyme Inhibition Constant Data from BindingDB
Found 4 hits for monomerid = 6180
Trg + Lig
Ki
nM
ΔG°
kcal/mole
IC50
nM
Kd
nM
EC50/IC50
nM
koff
s-1
kon
M-1s-1
pHTemp
°C
Platelet-derived growth factor receptor beta
(Mus musculus (mouse))
BDBM6180
(1,6-naphthyridine 77 | 3-tert-butyl-1-[3-(3,5-dime...)
Show SMILES COc1cc(OC)cc(c1)-c1cc2cnc(NCCCCCO)cc2nc1NC(=O)NC(C)(C)C
Show InChI InChI=1S/C26H35N5O4/c1-26(2,3)31-25(33)30-24-21(17-11-19(34-4)14-20(12-17)35-5)13-18-16-28-23(15-22(18)29-24)27-9-7-6-8-10-32/h11-16,32H,6-10H2,1-5H3,(H,27,28)(H2,29,30,31,33)
n/an/a 1.10E+4n/an/an/an/an/an/a
University of Auckland
Assay Description
Compounds were evaluated for their ability to prevent phosphorylation of a model glutamate-tyrosine copolymer substrate by isolated human FGFR-1, mou...
J Med Chem 48: 4628-53 (2005)
Article DOI: 10.1021/jm0500931
BindingDB Entry DOI: 10.7270/Q2DV1H3W
Vascular endothelial growth factor receptor 2
(Homo sapiens (Human))
BDBM6180
(1,6-naphthyridine 77 | 3-tert-butyl-1-[3-(3,5-dime...)
Show SMILES COc1cc(OC)cc(c1)-c1cc2cnc(NCCCCCO)cc2nc1NC(=O)NC(C)(C)C
Show InChI InChI=1S/C26H35N5O4/c1-26(2,3)31-25(33)30-24-21(17-11-19(34-4)14-20(12-17)35-5)13-18-16-28-23(15-22(18)29-24)27-9-7-6-8-10-32/h11-16,32H,6-10H2,1-5H3,(H,27,28)(H2,29,30,31,33)
NCI pathway
Reactome pathway
n/an/a 6n/an/an/an/an/an/a
University of Auckland
Assay Description
Tha assay was using human VEGFR-2 in DELFIA (dissociation-enhanced lanthanide fluoroimmunoassay) format. IC50 is the concentration of inhibitor that ...
J Med Chem 48: 4628-53 (2005)
Article DOI: 10.1021/jm0500931
BindingDB Entry DOI: 10.7270/Q2DV1H3W
Proto-oncogene tyrosine-protein kinase Src
(Homo sapiens (Human))
BDBM6180
(1,6-naphthyridine 77 | 3-tert-butyl-1-[3-(3,5-dime...)
Show SMILES COc1cc(OC)cc(c1)-c1cc2cnc(NCCCCCO)cc2nc1NC(=O)NC(C)(C)C
Show InChI InChI=1S/C26H35N5O4/c1-26(2,3)31-25(33)30-24-21(17-11-19(34-4)14-20(12-17)35-5)13-18-16-28-23(15-22(18)29-24)27-9-7-6-8-10-32/h11-16,32H,6-10H2,1-5H3,(H,27,28)(H2,29,30,31,33)
n/an/a>5.00E+4n/an/an/an/an/an/a
University of Auckland
Assay Description
Compounds were evaluated for their ability to prevent phosphorylation of a model glutamate-tyrosine copolymer substrate by isolated human FGFR-1, mou...
J Med Chem 48: 4628-53 (2005)
Article DOI: 10.1021/jm0500931
BindingDB Entry DOI: 10.7270/Q2DV1H3W
Fibroblast growth factor receptor 1
(Homo sapiens (Human))
BDBM6180
(1,6-naphthyridine 77 | 3-tert-butyl-1-[3-(3,5-dime...)
Show SMILES COc1cc(OC)cc(c1)-c1cc2cnc(NCCCCCO)cc2nc1NC(=O)NC(C)(C)C
Show InChI InChI=1S/C26H35N5O4/c1-26(2,3)31-25(33)30-24-21(17-11-19(34-4)14-20(12-17)35-5)13-18-16-28-23(15-22(18)29-24)27-9-7-6-8-10-32/h11-16,32H,6-10H2,1-5H3,(H,27,28)(H2,29,30,31,33)
NCI pathway
Reactome pathway
n/an/a 93n/an/an/an/an/an/a
University of Auckland
Assay Description
Compounds were evaluated for their ability to prevent phosphorylation of a model glutamate-tyrosine copolymer substrate by isolated human FGFR-1, mou...
J Med Chem 48: 4628-53 (2005)
Article DOI: 10.1021/jm0500931
BindingDB Entry DOI: 10.7270/Q2DV1H3W