null
SMILES: CC(C)Oc1ccn2c(cnc2c1)-c1ccnc(N[C@H]2CNCC[C@@H]2F)n1
InChI Key:
Activity Spreadsheet -- Enzyme Inhibition Constant Data from BindingDB
Found 3 hits for monomerid = 621138
Trg + Lig
Ki
nM
ΔG°
kcal/mole
IC50
nM
Kd
nM
EC50/IC50
nM
koff
s-1
kon
M-1s-1
pHTemp
°C
Interleukin-1 receptor-associated kinase 1
(Homo sapiens (Human))
BDBM621138
(N-((3S,4S)-4- fluoropiperidin-3-yl)-4-(7- isopropo...)
Show SMILES CC(C)Oc1ccn2c(cnc2c1)-c1ccnc(N[C@H]2CNCC[C@@H]2F)n1 |r|
n/an/a 18n/an/an/an/an/an/a
TBA
Citation and Details
Receptor-type tyrosine-protein kinase FLT3
(Homo sapiens (Human))
BDBM621138
(N-((3S,4S)-4- fluoropiperidin-3-yl)-4-(7- isopropo...)
Show SMILES CC(C)Oc1ccn2c(cnc2c1)-c1ccnc(N[C@H]2CNCC[C@@H]2F)n1 |r|
NCI pathway
Reactome pathway
n/an/a<0.5n/an/an/an/an/an/a
TBA
Citation and Details
Interleukin-1 receptor-associated kinase 4
(Homo sapiens (Human))
BDBM621138
(N-((3S,4S)-4- fluoropiperidin-3-yl)-4-(7- isopropo...)
Show SMILES CC(C)Oc1ccn2c(cnc2c1)-c1ccnc(N[C@H]2CNCC[C@@H]2F)n1 |r|
Reactome pathway
n/an/a 1n/an/an/an/an/an/a
TBA
Citation and Details