BDBM62229 2-(benzenesulfonyl)-6-methoxy-3-nitropyridine::2-besyl-6-methoxy-3-nitro-pyridine::6-methoxy-3-nitro-2-(phenylsulfonyl)pyridine::SR-01000762247::SR-01000762247-2::cid_2801236
SMILES: COc1ccc(c(n1)S(=O)(=O)c1ccccc1)[N+]([O-])=O
InChI Key: InChIKey=KDVGXXBOCUFNTQ-UHFFFAOYSA-N
Data: 3 IC50  1 EC50
Activity Spreadsheet -- Enzyme Inhibition Constant Data from BindingDB
Found 4 hits for monomerid = 62229
Trg + Lig
Ki
nM
ΔG°
kcal/mole
IC50
nM
Kd
nM
EC50/IC50
nM
koff
s-1
kon
M-1s-1
pHTemp
°C
Sphingosine 1-phosphate receptor 4
(Homo sapiens (Human))
BDBM62229
(2-(benzenesulfonyl)-6-methoxy-3-nitropyridine | 2-...)
Show SMILES COc1ccc(c(n1)S(=O)(=O)c1ccccc1)[N+]([O-])=O
Show InChI InChI=1S/C12H10N2O5S/c1-19-11-8-7-10(14(15)16)12(13-11)20(17,18)9-5-3-2-4-6-9/h2-8H,1H3
NCI pathway
Reactome pathway
PCBioAssay
n/an/a 1.42E+3n/an/an/an/an/an/a
The Scripps Research Institute Molecular Screening Center
Curated by PubChem BioAssay
Assay Description
Source (MLPCN Center Name): The Scripps Research Institute Molecular Screening Center (SRISMC) Center Affiliation: The Scripps Research Institute (TS...
PubChem Bioassay (2010)
BindingDB Entry DOI: 10.7270/Q2319TBQ
Serine/threonine-protein kinase RIPK2
(Homo sapiens (Human))
BDBM62229
(2-(benzenesulfonyl)-6-methoxy-3-nitropyridine | 2-...)
Show SMILES COc1ccc(c(n1)S(=O)(=O)c1ccccc1)[N+]([O-])=O
Show InChI InChI=1S/C12H10N2O5S/c1-19-11-8-7-10(14(15)16)12(13-11)20(17,18)9-5-3-2-4-6-9/h2-8H,1H3
PCBioAssay
n/an/a 3.15E+3n/an/an/an/an/an/a
The Scripps Research Institute Molecular Screening Center
Curated by PubChem BioAssay
PubChem Bioassay (2012)
BindingDB Entry DOI: 10.7270/Q2T15278
Beta lactamase
(Pseudomonas aeruginosa)
BDBM62229
(2-(benzenesulfonyl)-6-methoxy-3-nitropyridine | 2-...)
Show SMILES COc1ccc(c(n1)S(=O)(=O)c1ccccc1)[N+]([O-])=O
Show InChI InChI=1S/C12H10N2O5S/c1-19-11-8-7-10(14(15)16)12(13-11)20(17,18)9-5-3-2-4-6-9/h2-8H,1H3
PCBioAssay
n/an/a>4.97E+4n/an/an/an/an/an/a
The Scripps Research Institute Molecular Screening Center
Curated by PubChem BioAssay
PubChem Bioassay (2012)
BindingDB Entry DOI: 10.7270/Q2XS5T0R
LAP4
(Saccharomyces cerevisiae)
BDBM62229
(2-(benzenesulfonyl)-6-methoxy-3-nitropyridine | 2-...)
Show SMILES COc1ccc(c(n1)S(=O)(=O)c1ccccc1)[N+]([O-])=O
Show InChI InChI=1S/C12H10N2O5S/c1-19-11-8-7-10(14(15)16)12(13-11)20(17,18)9-5-3-2-4-6-9/h2-8H,1H3
PCBioAssay
n/an/an/an/a>3.30E+4n/an/an/an/a
NMMLSC
Curated by PubChem BioAssay
Assay Description
University of New Mexico Assay Overview: Assay Support: 1R03 MH086450-01 Project Title: Chemical Screen of TOR pathway GFP fusion proteins in S. ...
PubChem Bioassay (2010)
BindingDB Entry DOI: 10.7270/Q21R6P02