BDBM6230 8-Ethyl-2-(pyridin-4-ylamino)-8H-pyrido[2,3-d]pyrimidin-7-one::8-ethyl-2-(pyridin-4-ylamino)-7H,8H-pyrido[2,3-d]pyrimidin-7-one::C2 Pyrido[2,3-d]pyrimidin-7-one deriv. 22
SMILES: CCn1c2nc(Nc3ccncc3)ncc2ccc1=O
InChI Key: InChIKey=BMKRSRGITJQCJD-UHFFFAOYSA-N
Data: 1 IC50
Activity Spreadsheet -- Enzyme Inhibition Constant Data from BindingDB
Found 1 hit for monomerid = 6230
Trg + Lig
Ki
nM
ΔG°
kcal/mole
IC50
nM
Kd
nM
EC50/IC50
nM
koff
s-1
kon
M-1s-1
pHTemp
°C
Cyclin-Dependent Kinase 4 (CDK4)
(Homo sapiens (Human))
BDBM6230
(8-Ethyl-2-(pyridin-4-ylamino)-8H-pyrido[2,3-d]pyri...)
Show SMILES CCn1c2nc(Nc3ccncc3)ncc2ccc1=O
Show InChI InChI=1S/C14H13N5O/c1-2-19-12(20)4-3-10-9-16-14(18-13(10)19)17-11-5-7-15-8-6-11/h3-9H,2H2,1H3,(H,15,16,17,18)
NCI pathway
Reactome pathway
n/an/a 1.17E+3n/an/an/an/a7.425
Parke-Davis Pharmaceutical Research
Assay Description
The enzyme was assayed with substrate GST- retinoblastoma in the presence of 25 uM ATP/[gamma-32P] ATP. IC50 is the inhibitor concentration, which in...
J Med Chem 43: 4606-16 (2000)
Article DOI: 10.1021/jm000271k
BindingDB Entry DOI: 10.7270/Q25B00N4