BDBM62497 4-[2-[[2-(4-methyl-1-piperidinyl)-1-oxoethyl]amino]-4-thiazolyl]benzoic acid ethyl ester::4-[2-[[2-(4-methylpiperidino)acetyl]amino]thiazol-4-yl]benzoic acid ethyl ester::MLS001175133::SMR000595579::cid_2334129::ethyl 4-[2-[2-(4-methylpiperidin-1-yl)ethanoylamino]-1,3-thiazol-4-yl]benzoate::ethyl 4-[2-[[2-(4-methylpiperidin-1-yl)acetyl]amino]-1,3-thiazol-4-yl]benzoate
SMILES: CCOC(=O)c1ccc(cc1)-c1csc(NC(=O)CN2CCC(C)CC2)n1
InChI Key: InChIKey=LBVZJVQHGRYEID-UHFFFAOYSA-N
Data: 2 IC50
Activity Spreadsheet -- Enzyme Inhibition Constant Data from BindingDB
Found 2 hits for monomerid = 62497
Trg + Lig
Ki
nM
ΔG°
kcal/mole
IC50
nM
Kd
nM
EC50/IC50
nM
koff
s-1
kon
M-1s-1
pHTemp
°C
EBNA-1 protein
(Human herpesvirus 4)
BDBM62497
(4-[2-[[2-(4-methyl-1-piperidinyl)-1-oxoethyl]amino...)
Show SMILES CCOC(=O)c1ccc(cc1)-c1csc(NC(=O)CN2CCC(C)CC2)n1
Show InChI InChI=1S/C20H25N3O3S/c1-3-26-19(25)16-6-4-15(5-7-16)17-13-27-20(21-17)22-18(24)12-23-10-8-14(2)9-11-23/h4-7,13-14H,3,8-12H2,1-2H3,(H,21,22,24)
PCBioAssay
n/an/a 5.32E+3n/an/an/an/an/an/a
The Scripps Research Institute Molecular Screening Center
Curated by PubChem BioAssay
Assay Description
Source (MLPCN Center Name): The Scripps Research Institute Molecular Screening Center (SRIMSC) Center Affiliation: The Scripps Research Institute (TS...
PubChem Bioassay (2010)
BindingDB Entry DOI: 10.7270/Q2RJ4GXC
BZLF1
(Human herpesvirus 4)
BDBM62497
(4-[2-[[2-(4-methyl-1-piperidinyl)-1-oxoethyl]amino...)
Show SMILES CCOC(=O)c1ccc(cc1)-c1csc(NC(=O)CN2CCC(C)CC2)n1
Show InChI InChI=1S/C20H25N3O3S/c1-3-26-19(25)16-6-4-15(5-7-16)17-13-27-20(21-17)22-18(24)12-23-10-8-14(2)9-11-23/h4-7,13-14H,3,8-12H2,1-2H3,(H,21,22,24)
PCBioAssay
n/an/a 1.11E+5n/an/an/an/an/an/a
The Scripps Research Institute Molecular Screening Center
Curated by PubChem BioAssay
Assay Description
Source (MLPCN Center Name): The Scripps Research Institute Molecular Screening Center (SRIMSC) Center Affiliation: The Scripps Research Institute (TS...
PubChem Bioassay (2010)
BindingDB Entry DOI: 10.7270/Q2W957MN