null
SMILES:
InChI Key:
Activity Spreadsheet -- Enzyme Inhibition Constant Data from BindingDB
Found 4 hits for monomerid = 626148
Trg + Lig
Ki
nM
ΔG°
kcal/mole
IC50
nM
Kd
nM
EC50/IC50
nM
koff
s-1
kon
M-1s-1
pHTemp
°C
Adenosine receptor A2a
(Homo sapiens (Human))
BDBM626148
(US11786528, Example 35)
NCI pathway
Reactome pathway
n/an/a 4.20n/an/an/an/an/an/a
TBA
Citation and Details
Adenosine receptor A3
(Homo sapiens (Human))
BDBM626148
(US11786528, Example 35)
Reactome pathway
n/an/a 4.70E+3n/an/an/an/an/an/a
TBA
Citation and Details
Adenosine receptor A1
(Homo sapiens (Human))
BDBM626148
(US11786528, Example 35)
Reactome pathway
n/an/a 290n/an/an/an/an/an/a
TBA
Citation and Details
Alpha-2B adrenergic receptor
(Homo sapiens (Human))
BDBM626148
(US11786528, Example 35)
n/an/a 530n/an/an/an/an/an/a
TBA
Citation and Details