BDBM6322 2-{[5-(3-aminopyrrolidin-1-yl)pyridin-2-yl]amino}-8-cyclopentyl-6-acetyl-5-methyl-7H,8H-pyrido[2,3-d]pyrimidin-7-one::6-Acetyl-2-[5-(3-amino-pyrrolidin-1-yl)-pyridin-2-ylamino]-8-cyclopentyl-5-methyl-8H-pyrido[2,3-d]pyrimidin-7-one::Pyrido-[2,3-d]-pyrimidin-7-one 56
SMILES: CC(=O)c1c(C)c2cnc(Nc3ccc(cn3)N3CCC(N)C3)nc2n(C2CCCC2)c1=O
InChI Key: InChIKey=SOBJZSYZGDDPBD-UHFFFAOYSA-N
Data: 2 IC50
Activity Spreadsheet -- Enzyme Inhibition Constant Data from BindingDB
Found 2 hits for monomerid = 6322
Trg + Lig
Ki
nM
ΔG°
kcal/mole
IC50
nM
Kd
nM
EC50/IC50
nM
koff
s-1
kon
M-1s-1
pHTemp
°C
Cyclin-Dependent Kinase 2 (CDK2)
(Homo sapiens (Human))
BDBM6322
(2-{[5-(3-aminopyrrolidin-1-yl)pyridin-2-yl]amino}-...)
Show SMILES CC(=O)c1c(C)c2cnc(Nc3ccc(cn3)N3CCC(N)C3)nc2n(C2CCCC2)c1=O
Show InChI InChI=1S/C24H29N7O2/c1-14-19-12-27-24(28-20-8-7-18(11-26-20)30-10-9-16(25)13-30)29-22(19)31(17-5-3-4-6-17)23(33)21(14)15(2)32/h7-8,11-12,16-17H,3-6,9-10,13,25H2,1-2H3,(H,26,27,28,29)
NCI pathway
Reactome pathway
n/an/a>5.00E+3n/an/an/an/an/an/a
Pfizer
Assay Description
The enzyme was assayed with substrate GST- retinoblastoma in the presence of 12 uM ATP/[gamma-32P] ATP. IC50 is the inhibitor concentration, which in...
J Med Chem 48: 2388-406 (2005)
Article DOI: 10.1021/jm049354h
BindingDB Entry DOI: 10.7270/Q21J97Z9
Cyclin-Dependent Kinase 4 (CDK4)
(Homo sapiens (Human))
BDBM6322
(2-{[5-(3-aminopyrrolidin-1-yl)pyridin-2-yl]amino}-...)
Show SMILES CC(=O)c1c(C)c2cnc(Nc3ccc(cn3)N3CCC(N)C3)nc2n(C2CCCC2)c1=O
Show InChI InChI=1S/C24H29N7O2/c1-14-19-12-27-24(28-20-8-7-18(11-26-20)30-10-9-16(25)13-30)29-22(19)31(17-5-3-4-6-17)23(33)21(14)15(2)32/h7-8,11-12,16-17H,3-6,9-10,13,25H2,1-2H3,(H,26,27,28,29)
NCI pathway
Reactome pathway
n/an/a 14n/an/an/an/an/an/a
Pfizer
Assay Description
The enzyme was assayed with substrate GST- retinoblastoma in the presence of 25 uM ATP/[gamma-32P] ATP. IC50 is the inhibitor concentration, which in...
J Med Chem 48: 2388-406 (2005)
Article DOI: 10.1021/jm049354h
BindingDB Entry DOI: 10.7270/Q21J97Z9