null
SMILES: COc1ccc2cnc(Nc3ccc(cc3)N3CCNCC3)nc2c1C1CCCC1
InChI Key: InChIKey=AUTHYXJRHKFPPK-UHFFFAOYSA-N
Activity Spreadsheet -- Enzyme Inhibition Constant Data from BindingDB
Found 5 hits for monomerid = 6341
Trg + Lig
Ki
nM
ΔG°
kcal/mole
IC50
nM
Kd
nM
EC50/IC50
nM
koff
s-1
kon
M-1s-1
pHTemp
°C
Cyclin-dependent kinase/G2/mitotic-specific cyclin- 1
(Homo sapiens (Human))
BDBM6341
(2-Aminoquinazoline 20 | 8-cyclopentyl-7-methoxy-N-...)
Show SMILES COc1ccc2cnc(Nc3ccc(cc3)N3CCNCC3)nc2c1C1CCCC1
Show InChI InChI=1S/C24H29N5O/c1-30-21-11-6-18-16-26-24(28-23(18)22(21)17-4-2-3-5-17)27-19-7-9-20(10-8-19)29-14-12-25-13-15-29/h6-11,16-17,25H,2-5,12-15H2,1H3,(H,26,27,28)
Reactome pathway
n/an/a 132n/an/an/an/a7.425
NAEJA Pharmaceutical Inc.
Assay Description
The enzyme was assayed with substrate GST- retinoblastoma in the presence of 12 uM ATP/[gamma-32P] ATP. IC50 is the inhibitor concentration, which in...
Bioorg Med Chem Lett 15: 3881-5 (2005)
Article DOI: 10.1016/j.bmcl.2005.05.131
BindingDB Entry DOI: 10.7270/Q2WW7FVW
Cyclin-A2/Cyclin-dependent kinase 2
(Homo sapiens (Human))
BDBM6341
(2-Aminoquinazoline 20 | 8-cyclopentyl-7-methoxy-N-...)
Show SMILES COc1ccc2cnc(Nc3ccc(cc3)N3CCNCC3)nc2c1C1CCCC1
Show InChI InChI=1S/C24H29N5O/c1-30-21-11-6-18-16-26-24(28-23(18)22(21)17-4-2-3-5-17)27-19-7-9-20(10-8-19)29-14-12-25-13-15-29/h6-11,16-17,25H,2-5,12-15H2,1H3,(H,26,27,28)
NCI pathway
Reactome pathway
n/an/a 28n/an/an/an/an/an/a
NAEJA Pharmaceutical Inc.
Assay Description
The enzyme was assayed with substrate GST- retinoblastoma in the presence of 12 uM ATP/[gamma-32P] ATP. IC50 is the inhibitor concentration, which in...
Bioorg Med Chem Lett 15: 3881-5 (2005)
Article DOI: 10.1016/j.bmcl.2005.05.131
BindingDB Entry DOI: 10.7270/Q2WW7FVW
Cyclin-dependent kinase 2/G1/S-specific cyclin-E1
(Homo sapiens (Human))
BDBM6341
(2-Aminoquinazoline 20 | 8-cyclopentyl-7-methoxy-N-...)
Show SMILES COc1ccc2cnc(Nc3ccc(cc3)N3CCNCC3)nc2c1C1CCCC1
Show InChI InChI=1S/C24H29N5O/c1-30-21-11-6-18-16-26-24(28-23(18)22(21)17-4-2-3-5-17)27-19-7-9-20(10-8-19)29-14-12-25-13-15-29/h6-11,16-17,25H,2-5,12-15H2,1H3,(H,26,27,28)
n/an/a 251n/an/an/an/an/an/a
University of Tours
Curated by ChEMBL
Assay Description
Inhibition of CDK2/Cyclin E (unknown origin)
Eur J Med Chem 108: 701-19 (2016)
BindingDB Entry DOI: 10.7270/Q22J6DQD
Cyclin-dependent kinase 4/G1/S-specific cyclin-D1 [L188C]
(Homo sapiens (Human))
BDBM6341
(2-Aminoquinazoline 20 | 8-cyclopentyl-7-methoxy-N-...)
Show SMILES COc1ccc2cnc(Nc3ccc(cc3)N3CCNCC3)nc2c1C1CCCC1
Show InChI InChI=1S/C24H29N5O/c1-30-21-11-6-18-16-26-24(28-23(18)22(21)17-4-2-3-5-17)27-19-7-9-20(10-8-19)29-14-12-25-13-15-29/h6-11,16-17,25H,2-5,12-15H2,1H3,(H,26,27,28)
NCI pathway
Reactome pathway
n/an/a 1n/an/an/an/an/an/a
NAEJA Pharmaceutical Inc.
Assay Description
The enzyme was assayed with substrate GST- retinoblastoma in the presence of 25 uM ATP/[gamma-32P] ATP. IC50 is the inhibitor concentration, which in...
Bioorg Med Chem Lett 15: 3881-5 (2005)
Article DOI: 10.1016/j.bmcl.2005.05.131
BindingDB Entry DOI: 10.7270/Q2WW7FVW
Cyclin-dependent kinase 2/G1/S-specific cyclin-E1
(Homo sapiens (Human))
BDBM6341
(2-Aminoquinazoline 20 | 8-cyclopentyl-7-methoxy-N-...)
Show SMILES COc1ccc2cnc(Nc3ccc(cc3)N3CCNCC3)nc2c1C1CCCC1
Show InChI InChI=1S/C24H29N5O/c1-30-21-11-6-18-16-26-24(28-23(18)22(21)17-4-2-3-5-17)27-19-7-9-20(10-8-19)29-14-12-25-13-15-29/h6-11,16-17,25H,2-5,12-15H2,1H3,(H,26,27,28)
n/an/a 250n/an/an/an/an/an/a
NAEJA Pharmaceutical Inc.
Assay Description
The enzyme was assayed with substrate GST- retinoblastoma in the presence of 12 uM ATP/[gamma-32P] ATP. IC50 is the inhibitor concentration, which in...
Bioorg Med Chem Lett 15: 3881-5 (2005)
Article DOI: 10.1016/j.bmcl.2005.05.131
BindingDB Entry DOI: 10.7270/Q2WW7FVW