BDBM6352 2-Aminoquinazoline 31::8-cyclopentyl-5-methyl-2-{[4-(piperazin-1-yl)phenyl]amino}-7H,8H-pyrido[2,3-d]pyrimidin-7-one::Pyrido[2,3-d]pyrimidin-7-one 10
SMILES: Cc1cc(=O)n(C2CCCC2)c2nc(Nc3ccc(cc3)N3CCNCC3)ncc12
InChI Key: InChIKey=LRDLFKVCAQLFQM-UHFFFAOYSA-N
Data: 8 IC50
Activity Spreadsheet -- Enzyme Inhibition Constant Data from BindingDB
Found 8 hits for monomerid = 6352
Trg + Lig
Ki
nM
ΔG°
kcal/mole
IC50
nM
Kd
nM
EC50/IC50
nM
koff
s-1
kon
M-1s-1
pHTemp
°C
Cyclin-Dependent Kinase 1 (CDK1)
(Homo sapiens (Human))
BDBM6352
(2-Aminoquinazoline 31 | 8-cyclopentyl-5-methyl-2-{...)
Show SMILES Cc1cc(=O)n(C2CCCC2)c2nc(Nc3ccc(cc3)N3CCNCC3)ncc12
Show InChI InChI=1S/C23H28N6O/c1-16-14-21(30)29(19-4-2-3-5-19)22-20(16)15-25-23(27-22)26-17-6-8-18(9-7-17)28-12-10-24-11-13-28/h6-9,14-15,19,24H,2-5,10-13H2,1H3,(H,25,26,27)
Reactome pathway
n/an/a>5.00E+3n/an/an/an/an/an/a
NAEJA Pharmaceutical Inc.
Assay Description
The enzyme was assayed with substrate GST- retinoblastoma in the presence of 12 uM ATP/[gamma-32P] ATP. IC50 is the inhibitor concentration, which in...
Bioorg Med Chem Lett 15: 3881-5 (2005)
Article DOI: 10.1016/j.bmcl.2005.05.131
BindingDB Entry DOI: 10.7270/Q2WW7FVW
Cyclin-Dependent Kinase 2 (CDK2)
(Homo sapiens (Human))
BDBM6352
(2-Aminoquinazoline 31 | 8-cyclopentyl-5-methyl-2-{...)
Show SMILES Cc1cc(=O)n(C2CCCC2)c2nc(Nc3ccc(cc3)N3CCNCC3)ncc12
Show InChI InChI=1S/C23H28N6O/c1-16-14-21(30)29(19-4-2-3-5-19)22-20(16)15-25-23(27-22)26-17-6-8-18(9-7-17)28-12-10-24-11-13-28/h6-9,14-15,19,24H,2-5,10-13H2,1H3,(H,25,26,27)
NCI pathway
Reactome pathway
n/an/a>5.00E+3n/an/an/an/an/an/a
NAEJA Pharmaceutical Inc.
Assay Description
The enzyme was assayed with substrate GST- retinoblastoma in the presence of 12 uM ATP/[gamma-32P] ATP. IC50 is the inhibitor concentration, which in...
Bioorg Med Chem Lett 15: 3881-5 (2005)
Article DOI: 10.1016/j.bmcl.2005.05.131
BindingDB Entry DOI: 10.7270/Q2WW7FVW
CDK2/CycE
(Homo sapiens (Human))
BDBM6352
(2-Aminoquinazoline 31 | 8-cyclopentyl-5-methyl-2-{...)
Show SMILES Cc1cc(=O)n(C2CCCC2)c2nc(Nc3ccc(cc3)N3CCNCC3)ncc12
Show InChI InChI=1S/C23H28N6O/c1-16-14-21(30)29(19-4-2-3-5-19)22-20(16)15-25-23(27-22)26-17-6-8-18(9-7-17)28-12-10-24-11-13-28/h6-9,14-15,19,24H,2-5,10-13H2,1H3,(H,25,26,27)
n/an/a>5.00E+3n/an/an/an/an/an/a
NAEJA Pharmaceutical Inc.
Assay Description
The enzyme was assayed with substrate GST- retinoblastoma in the presence of 12 uM ATP/[gamma-32P] ATP. IC50 is the inhibitor concentration, which i...
Bioorg Med Chem Lett 15: 3881-5 (2005)
Article DOI: 10.1016/j.bmcl.2005.05.131
BindingDB Entry DOI: 10.7270/Q2WW7FVW
CDK2/CycE
(Homo sapiens (Human))
BDBM6352
(2-Aminoquinazoline 31 | 8-cyclopentyl-5-methyl-2-{...)
Show SMILES Cc1cc(=O)n(C2CCCC2)c2nc(Nc3ccc(cc3)N3CCNCC3)ncc12
Show InChI InChI=1S/C23H28N6O/c1-16-14-21(30)29(19-4-2-3-5-19)22-20(16)15-25-23(27-22)26-17-6-8-18(9-7-17)28-12-10-24-11-13-28/h6-9,14-15,19,24H,2-5,10-13H2,1H3,(H,25,26,27)
n/an/a>5.00E+3n/an/an/an/an/an/a
Pfizer
Assay Description
The enzyme was assayed with substrate GST- retinoblastoma in the presence of 12 uM ATP/[gamma-32P] ATP. IC50 is the inhibitor concentration, which in...
J Med Chem 48: 2371-87 (2005)
Article DOI: 10.1021/jm049355+
BindingDB Entry DOI: 10.7270/Q2S46Q5B
Cyclin-Dependent Kinase 4 (CDK4)
(Homo sapiens (Human))
BDBM6352
(2-Aminoquinazoline 31 | 8-cyclopentyl-5-methyl-2-{...)
Show SMILES Cc1cc(=O)n(C2CCCC2)c2nc(Nc3ccc(cc3)N3CCNCC3)ncc12
Show InChI InChI=1S/C23H28N6O/c1-16-14-21(30)29(19-4-2-3-5-19)22-20(16)15-25-23(27-22)26-17-6-8-18(9-7-17)28-12-10-24-11-13-28/h6-9,14-15,19,24H,2-5,10-13H2,1H3,(H,25,26,27)
NCI pathway
Reactome pathway
n/an/a 14n/an/an/an/a7.425
Pfizer
Assay Description
The enzyme was assayed with substrate GST- retinoblastoma in the presence of 25 uM ATP/[gamma-32P] ATP. IC50 is the inhibitor concentration, which in...
J Med Chem 48: 2371-87 (2005)
Article DOI: 10.1021/jm049355+
BindingDB Entry DOI: 10.7270/Q2S46Q5B
Cyclin-Dependent Kinase 1 (CDK1)
(Homo sapiens (Human))
BDBM6352
(2-Aminoquinazoline 31 | 8-cyclopentyl-5-methyl-2-{...)
Show SMILES Cc1cc(=O)n(C2CCCC2)c2nc(Nc3ccc(cc3)N3CCNCC3)ncc12
Show InChI InChI=1S/C23H28N6O/c1-16-14-21(30)29(19-4-2-3-5-19)22-20(16)15-25-23(27-22)26-17-6-8-18(9-7-17)28-12-10-24-11-13-28/h6-9,14-15,19,24H,2-5,10-13H2,1H3,(H,25,26,27)
Reactome pathway
n/an/a>5.00E+3n/an/an/an/an/an/a
Pfizer
Assay Description
The enzyme was assayed with substrate GST- retinoblastoma in the presence of 12 uM ATP/[gamma-32P] ATP. IC50 is the inhibitor concentration, which in...
J Med Chem 48: 2371-87 (2005)
Article DOI: 10.1021/jm049355+
BindingDB Entry DOI: 10.7270/Q2S46Q5B
Cyclin-Dependent Kinase 2 (CDK2)
(Homo sapiens (Human))
BDBM6352
(2-Aminoquinazoline 31 | 8-cyclopentyl-5-methyl-2-{...)
Show SMILES Cc1cc(=O)n(C2CCCC2)c2nc(Nc3ccc(cc3)N3CCNCC3)ncc12
Show InChI InChI=1S/C23H28N6O/c1-16-14-21(30)29(19-4-2-3-5-19)22-20(16)15-25-23(27-22)26-17-6-8-18(9-7-17)28-12-10-24-11-13-28/h6-9,14-15,19,24H,2-5,10-13H2,1H3,(H,25,26,27)
NCI pathway
Reactome pathway
n/an/a>5.00E+3n/an/an/an/an/an/a
Pfizer
Assay Description
The enzyme was assayed with substrate GST- retinoblastoma in the presence of 12 uM ATP/[gamma-32P] ATP. IC50 is the inhibitor concentration, which in...
J Med Chem 48: 2371-87 (2005)
Article DOI: 10.1021/jm049355+
BindingDB Entry DOI: 10.7270/Q2S46Q5B
Cyclin-Dependent Kinase 4 (CDK4)
(Homo sapiens (Human))
BDBM6352
(2-Aminoquinazoline 31 | 8-cyclopentyl-5-methyl-2-{...)
Show SMILES Cc1cc(=O)n(C2CCCC2)c2nc(Nc3ccc(cc3)N3CCNCC3)ncc12
Show InChI InChI=1S/C23H28N6O/c1-16-14-21(30)29(19-4-2-3-5-19)22-20(16)15-25-23(27-22)26-17-6-8-18(9-7-17)28-12-10-24-11-13-28/h6-9,14-15,19,24H,2-5,10-13H2,1H3,(H,25,26,27)
NCI pathway
Reactome pathway
n/an/a 14n/an/an/an/an/an/a
NAEJA Pharmaceutical Inc.
Assay Description
The enzyme was assayed with substrate GST- retinoblastoma in the presence of 25 uM ATP/[gamma-32P] ATP. IC50 is the inhibitor concentration, which in...
Bioorg Med Chem Lett 15: 3881-5 (2005)
Article DOI: 10.1016/j.bmcl.2005.05.131
BindingDB Entry DOI: 10.7270/Q2WW7FVW