BDBM6386 8-Cyclopentyl-5-methyl-7-oxo-2-(4-piperazin-1-yl-phenylamino)-7,8-dihydro-pyrido[2,3-d]pyrimidine-6-carboxylic Acid Methyl Ester::methyl 8-cyclopentyl-5-methyl-7-oxo-2-{[4-(piperazin-1-yl)phenyl]amino}-7H,8H-pyrido[2,3-d]pyrimidine-6-carboxylate::pyrido[2,3-d]pyrimidin-7-one 33
SMILES: COC(=O)c1c(C)c2cnc(Nc3ccc(cc3)N3CCNCC3)nc2n(C2CCCC2)c1=O
InChI Key: InChIKey=UGPPBMDIMQEVBD-UHFFFAOYSA-N
Data: 4 IC50
Activity Spreadsheet -- Enzyme Inhibition Constant Data from BindingDB
Found 4 hits for monomerid = 6386
Trg + Lig
Ki
nM
ΔG°
kcal/mole
IC50
nM
Kd
nM
EC50/IC50
nM
koff
s-1
kon
M-1s-1
pHTemp
°C
Cyclin-Dependent Kinase 4 (CDK4)
(Homo sapiens (Human))
BDBM6386
(8-Cyclopentyl-5-methyl-7-oxo-2-(4-piperazin-1-yl-p...)
Show SMILES COC(=O)c1c(C)c2cnc(Nc3ccc(cc3)N3CCNCC3)nc2n(C2CCCC2)c1=O
Show InChI InChI=1S/C25H30N6O3/c1-16-20-15-27-25(28-17-7-9-18(10-8-17)30-13-11-26-12-14-30)29-22(20)31(19-5-3-4-6-19)23(32)21(16)24(33)34-2/h7-10,15,19,26H,3-6,11-14H2,1-2H3,(H,27,28,29)
NCI pathway
Reactome pathway
n/an/a 4n/an/an/an/an/an/a
Pfizer
Assay Description
The enzyme was assayed with substrate GST- retinoblastoma in the presence of 25 uM ATP/[gamma-32P] ATP. IC50 is the inhibitor concentration, which in...
J Med Chem 48: 2371-87 (2005)
Article DOI: 10.1021/jm049355+
BindingDB Entry DOI: 10.7270/Q2S46Q5B
CDK2/CycE
(Homo sapiens (Human))
BDBM6386
(8-Cyclopentyl-5-methyl-7-oxo-2-(4-piperazin-1-yl-p...)
Show SMILES COC(=O)c1c(C)c2cnc(Nc3ccc(cc3)N3CCNCC3)nc2n(C2CCCC2)c1=O
Show InChI InChI=1S/C25H30N6O3/c1-16-20-15-27-25(28-17-7-9-18(10-8-17)30-13-11-26-12-14-30)29-22(20)31(19-5-3-4-6-19)23(32)21(16)24(33)34-2/h7-10,15,19,26H,3-6,11-14H2,1-2H3,(H,27,28,29)
n/an/a>5.00E+3n/an/an/an/an/an/a
Pfizer
Assay Description
The enzyme was assayed with substrate GST- retinoblastoma in the presence of 12 uM ATP/[gamma-32P] ATP. IC50 is the inhibitor concentration, which in...
J Med Chem 48: 2371-87 (2005)
Article DOI: 10.1021/jm049355+
BindingDB Entry DOI: 10.7270/Q2S46Q5B
Cyclin-Dependent Kinase 2 (CDK2)
(Homo sapiens (Human))
BDBM6386
(8-Cyclopentyl-5-methyl-7-oxo-2-(4-piperazin-1-yl-p...)
Show SMILES COC(=O)c1c(C)c2cnc(Nc3ccc(cc3)N3CCNCC3)nc2n(C2CCCC2)c1=O
Show InChI InChI=1S/C25H30N6O3/c1-16-20-15-27-25(28-17-7-9-18(10-8-17)30-13-11-26-12-14-30)29-22(20)31(19-5-3-4-6-19)23(32)21(16)24(33)34-2/h7-10,15,19,26H,3-6,11-14H2,1-2H3,(H,27,28,29)
NCI pathway
Reactome pathway
n/an/a 2.82E+3n/an/an/an/an/an/a
Pfizer
Assay Description
The enzyme was assayed with substrate GST- retinoblastoma in the presence of 12 uM ATP/[gamma-32P] ATP. IC50 is the inhibitor concentration, which in...
J Med Chem 48: 2371-87 (2005)
Article DOI: 10.1021/jm049355+
BindingDB Entry DOI: 10.7270/Q2S46Q5B
Cyclin-Dependent Kinase 1 (CDK1)
(Homo sapiens (Human))
BDBM6386
(8-Cyclopentyl-5-methyl-7-oxo-2-(4-piperazin-1-yl-p...)
Show SMILES COC(=O)c1c(C)c2cnc(Nc3ccc(cc3)N3CCNCC3)nc2n(C2CCCC2)c1=O
Show InChI InChI=1S/C25H30N6O3/c1-16-20-15-27-25(28-17-7-9-18(10-8-17)30-13-11-26-12-14-30)29-22(20)31(19-5-3-4-6-19)23(32)21(16)24(33)34-2/h7-10,15,19,26H,3-6,11-14H2,1-2H3,(H,27,28,29)
Reactome pathway
n/an/a>5.00E+3n/an/an/an/an/an/a
Pfizer
Assay Description
The enzyme was assayed with substrate GST- retinoblastoma in the presence of 12 uM ATP/[gamma-32P] ATP. IC50 is the inhibitor concentration, which in...
J Med Chem 48: 2371-87 (2005)
Article DOI: 10.1021/jm049355+
BindingDB Entry DOI: 10.7270/Q2S46Q5B